BDBM50191304 Amino(2-(2-Fluorobenzylidene)Hydrazinyl)Methaniminium Chloride::CHEMBL2346942
SMILES: Cl.NC(=N)N\N=C\c1ccccc1F
InChI Key: InChIKey=GDAONOZZOJTSID-NKPNRJPBSA-N
Data: 1 IC50  1 Kd
Activity Spreadsheet -- Enzyme Inhibition Constant Data from BindingDB
Found 2 hits for monomerid = 50191304
Trg + Lig
Ki
nM
ΔG°
kcal/mole
IC50
nM
Kd
nM
EC50/IC50
nM
koff
s-1
kon
M-1s-1
pHTemp
°C
NMDA receptor subtype 2A protein (NR2A)
(Homo sapiens (Human))
BDBM50191304
(Amino(2-(2-Fluorobenzylidene)Hydrazinyl)Methanimin...)
Show SMILES Cl.NC(=N)N\N=C\c1ccccc1F
Show InChI InChI=1S/C8H9FN4.ClH/c9-7-4-2-1-3-6(7)5-12-13-8(10)11;/h1-5H,(H4,10,11,13);1H/b12-5+;
n/an/a 7.41E+4n/an/an/an/an/an/a
University of Kentucky
Curated by ChEMBL
Assay Description
Displacement of [3H]MK-801 from NMDA receptor complex (unknown origin) after 40 mins
Bioorg Med Chem 21: 1764-74 (2013)
Article DOI: 10.1016/j.bmc.2013.01.051
BindingDB Entry DOI: 10.7270/Q2M048CZ
Heme oxygenase
(Pseudomonas aeruginosa)
BDBM50191304
(Amino(2-(2-Fluorobenzylidene)Hydrazinyl)Methanimin...)
Show SMILES Cl.NC(=N)N\N=C\c1ccccc1F
Show InChI InChI=1S/C8H9FN4.ClH/c9-7-4-2-1-3-6(7)5-12-13-8(10)11;/h1-5H,(H4,10,11,13);1H/b12-5+;
n/an/an/a 1.10E+4n/an/an/an/an/a
University of Maryland
Curated by ChEMBL
Assay Description
Binding affinity to Pseudomonas aeruginosa HemO by intrinsic fluorescence quenching method
J Med Chem 59: 6929-42 (2016)
BindingDB Entry DOI: 10.7270/Q26W9D18