BDBM50191307 CHEMBL3900440
SMILES: Cl.[#7]\[#6](-[#7])=[#7]\[#7]=[#6]\c1ccccc1Br
InChI Key: InChIKey=ZUKFEARIYIWCHH-NKPNRJPBSA-N
Data: 1 Kd
Activity Spreadsheet -- Enzyme Inhibition Constant Data from BindingDB
Found 1 hit for monomerid = 50191307
Trg + Lig
Ki
nM
ΔG°
kcal/mole
IC50
nM
Kd
nM
EC50/IC50
nM
koff
s-1
kon
M-1s-1
pHTemp
°C
Heme oxygenase
(Pseudomonas aeruginosa)
BDBM50191307
(CHEMBL3900440)
Show SMILES Cl.[#7]\[#6](-[#7])=[#7]\[#7]=[#6]\c1ccccc1Br
Show InChI InChI=1S/C8H9BrN4.ClH/c9-7-4-2-1-3-6(7)5-12-13-8(10)11;/h1-5H,(H4,10,11,13);1H/b12-5+;
n/an/an/a 6.70E+3n/an/an/an/an/a
University of Maryland
Curated by ChEMBL
Assay Description
Binding affinity to Pseudomonas aeruginosa HemO by intrinsic fluorescence quenching method
J Med Chem 59: 6929-42 (2016)
BindingDB Entry DOI: 10.7270/Q26W9D18