BDBM50191436 (2'Z,3'E)-7-bromoindirubin-3'-[O-(2-piperazin-1-ylethyl)oxime] dihydrochloride::CHEMBL379713
SMILES: Oc1[nH]c2c(Br)cccc2c1C1=Nc2ccccc2\C1=N/OCC[NH+]1CC[NH2+]CC1
InChI Key: InChIKey=GKPYOIONIPTTMQ-NHFJDJAPSA-P
Data: 2 IC50
Activity Spreadsheet -- Enzyme Inhibition Constant Data from BindingDB
Found 2 hits for monomerid = 50191436
Trg + Lig
Ki
nM
ΔG°
kcal/mole
IC50
nM
Kd
nM
EC50/IC50
nM
koff
s-1
kon
M-1s-1
pHTemp
°C
Aryl hydrocarbon receptor
(Homo sapiens (Human))
BDBM50191436
((2'Z,3'E)-7-bromoindirubin-3'-[O-(2-piperazin-1-yl...)
Show SMILES Oc1[nH]c2c(Br)cccc2c1C1=Nc2ccccc2\C1=N/OCC[NH+]1CC[NH2+]CC1 |t:13|
Show InChI InChI=1S/C22H22BrN5O2/c23-16-6-3-5-15-18(22(29)26-19(15)16)21-20(14-4-1-2-7-17(14)25-21)27-30-13-12-28-10-8-24-9-11-28/h1-7,24,26,29H,8-13H2/p+2/b27-20+
n/an/a 5.40E+3n/an/an/an/an/an/a
C.N.R.S.
Curated by ChEMBL
Assay Description
Survival of mouse AhR +/+ 5L cells after 48 hrs by MTS reduction assay
J Med Chem 49: 4638-49 (2006)
Article DOI: 10.1021/jm060314i
BindingDB Entry DOI: 10.7270/Q21G0N3Z
Cyclin-Dependent Kinase 5 (CDK5)
(Homo sapiens (Human))
BDBM50191436
((2'Z,3'E)-7-bromoindirubin-3'-[O-(2-piperazin-1-yl...)
Show SMILES Oc1[nH]c2c(Br)cccc2c1C1=Nc2ccccc2\C1=N/OCC[NH+]1CC[NH2+]CC1 |t:13|
Show InChI InChI=1S/C22H22BrN5O2/c23-16-6-3-5-15-18(22(29)26-19(15)16)21-20(14-4-1-2-7-17(14)25-21)27-30-13-12-28-10-8-24-9-11-28/h1-7,24,26,29H,8-13H2/p+2/b27-20+
NCI pathway
Reactome pathway
n/an/a>1.00E+4n/an/an/an/an/an/a
C.N.R.S.
Curated by ChEMBL
Assay Description
Inhibition of mammalian CDK5/p25
J Med Chem 49: 4638-49 (2006)
Article DOI: 10.1021/jm060314i
BindingDB Entry DOI: 10.7270/Q21G0N3Z