BDBM50191505 2-[4-(4-carbamoyl-4'-chlorobiphenyl-2-ylmethoxy)phenyl]-1-cyclohexyl-1H-benzimidazole-5-carboxylic acid::CHEMBL438430
SMILES: NC(=O)c1ccc(c(COc2ccc(cc2)-c2nc3cc(ccc3n2C2CCCCC2)C(O)=O)c1)-c1ccc(Cl)cc1
InChI Key: InChIKey=ORBOWDVLFIJQRM-UHFFFAOYSA-N
Data: 1 IC50
Activity Spreadsheet -- Enzyme Inhibition Constant Data from BindingDB
Found 1 hit for monomerid = 50191505
Trg + Lig
Ki
nM
ΔG°
kcal/mole
IC50
nM
Kd
nM
EC50/IC50
nM
koff
s-1
kon
M-1s-1
pHTemp
°C
Hepatitis C virus NS5B RNA-dependent RNA polymerase
(Hepatitis C virus)
BDBM50191505
(2-[4-(4-carbamoyl-4'-chlorobiphenyl-2-ylmethoxy)ph...)
Show SMILES NC(=O)c1ccc(c(COc2ccc(cc2)-c2nc3cc(ccc3n2C2CCCCC2)C(O)=O)c1)-c1ccc(Cl)cc1
Show InChI InChI=1S/C34H30ClN3O4/c35-26-12-6-21(7-13-26)29-16-10-23(32(36)39)18-25(29)20-42-28-14-8-22(9-15-28)33-37-30-19-24(34(40)41)11-17-31(30)38(33)27-4-2-1-3-5-27/h6-19,27H,1-5,20H2,(H2,36,39)(H,40,41)
n/an/a 13n/an/an/an/an/an/a
Central Pharmaceutical Research Institute
Curated by ChEMBL
Assay Description
Inhibition of HCV 1b BK six His-tagged C-terminal truncated 544 amino acid NS5B RNA dependent RNA polymerase
J Med Chem 49: 4721-36 (2006)
Article DOI: 10.1021/jm060269e
BindingDB Entry DOI: 10.7270/Q2FN15TD