BDBM50191517 2-[4-(5-chloro-2-pyridin-3-yl-benzyloxy)phenyl]-1-cyclohexyl-1H-benzimidazole-5-carboxylic acid::CHEMBL209282
SMILES: OC(=O)c1ccc2n(C3CCCCC3)c(nc2c1)-c1ccc(OCc2cc(Cl)ccc2-c2cccnc2)cc1
InChI Key: InChIKey=HQPJTGDPZVWHDP-UHFFFAOYSA-N
Data: 3 IC50
Activity Spreadsheet -- Enzyme Inhibition Constant Data from BindingDB
Found 3 hits for monomerid = 50191517
Trg + Lig
Ki
nM
ΔG°
kcal/mole
IC50
nM
Kd
nM
EC50/IC50
nM
koff
s-1
kon
M-1s-1
pHTemp
°C
Hepatitis C virus NS5B RNA-dependent RNA polymerase
(Hepatitis C virus)
BDBM50191517
(2-[4-(5-chloro-2-pyridin-3-yl-benzyloxy)phenyl]-1-...)
Show SMILES OC(=O)c1ccc2n(C3CCCCC3)c(nc2c1)-c1ccc(OCc2cc(Cl)ccc2-c2cccnc2)cc1
Show InChI InChI=1S/C32H28ClN3O3/c33-25-11-14-28(23-5-4-16-34-19-23)24(17-25)20-39-27-12-8-21(9-13-27)31-35-29-18-22(32(37)38)10-15-30(29)36(31)26-6-2-1-3-7-26/h4-5,8-19,26H,1-3,6-7,20H2,(H,37,38)
n/an/a 290n/an/an/an/an/an/a
Central Pharmaceutical Research Institute
Curated by ChEMBL
Assay Description
Inhibition of HCV 1b BK six His-tagged C-terminal truncated 544 amino acid NS5B RNA dependent RNA polymerase
J Med Chem 49: 4721-36 (2006)
Article DOI: 10.1021/jm060269e
BindingDB Entry DOI: 10.7270/Q2FN15TD
RNA-directed RNA polymerase
(Hepatitis C virus genotype 1)
BDBM50191517
(2-[4-(5-chloro-2-pyridin-3-yl-benzyloxy)phenyl]-1-...)
Show SMILES OC(=O)c1ccc2n(C3CCCCC3)c(nc2c1)-c1ccc(OCc2cc(Cl)ccc2-c2cccnc2)cc1
Show InChI InChI=1S/C32H28ClN3O3/c33-25-11-14-28(23-5-4-16-34-19-23)24(17-25)20-39-27-12-8-21(9-13-27)31-35-29-18-22(32(37)38)10-15-30(29)36(31)26-6-2-1-3-7-26/h4-5,8-19,26H,1-3,6-7,20H2,(H,37,38)
n/an/a 3.45E+6n/an/an/an/an/an/a
TBA
Assay Description
Inhibition of Hepatitis C virus genotype 1 NS5B polymerases lacking C-terminal 47 amino acid residues expressed in Escherichia coli after 60 min
Citation and Details
Article DOI: 10.1007/s00044-012-0186-8
BindingDB Entry DOI: 10.7270/Q2NC6441
RNA-directed RNA polymerase
(Hepatitis C virus genotype 1)
BDBM50191517
(2-[4-(5-chloro-2-pyridin-3-yl-benzyloxy)phenyl]-1-...)
Show SMILES OC(=O)c1ccc2n(C3CCCCC3)c(nc2c1)-c1ccc(OCc2cc(Cl)ccc2-c2cccnc2)cc1
Show InChI InChI=1S/C32H28ClN3O3/c33-25-11-14-28(23-5-4-16-34-19-23)24(17-25)20-39-27-12-8-21(9-13-27)31-35-29-18-22(32(37)38)10-15-30(29)36(31)26-6-2-1-3-7-26/h4-5,8-19,26H,1-3,6-7,20H2,(H,37,38)
n/an/a 290n/an/an/an/an/an/a
TBA
Assay Description
Inhibition of Hepatitis C virus genotype 1 NS5B polymerases lacking C-terminal 47 amino acid residues expressed in Escherichia coli after 60 min
Citation and Details
Article DOI: 10.1007/s00044-012-0186-8
BindingDB Entry DOI: 10.7270/Q2NC6441