BDBM50191535 2-[4-(biphenyl-2-ylmethoxy)-2-trifluoromethylphenyl]-1-cyclohexyl-1H-benzoimidazole-5-carboxylic acid::CHEMBL384679
SMILES: OC(=O)c1ccc2n(C3CCCCC3)c(nc2c1)-c1ccc(OCc2ccccc2-c2ccccc2)cc1C(F)(F)F
InChI Key: InChIKey=WKBJPSSQTDQRLU-UHFFFAOYSA-N
Data: 3 IC50
Activity Spreadsheet -- Enzyme Inhibition Constant Data from BindingDB
Found 3 hits for monomerid = 50191535
Trg + Lig
Ki
nM
ΔG°
kcal/mole
IC50
nM
Kd
nM
EC50/IC50
nM
koff
s-1
kon
M-1s-1
pHTemp
°C
Hepatitis C virus NS5B RNA-dependent RNA polymerase
(Hepatitis C virus)
BDBM50191535
(2-[4-(biphenyl-2-ylmethoxy)-2-trifluoromethylpheny...)
Show SMILES OC(=O)c1ccc2n(C3CCCCC3)c(nc2c1)-c1ccc(OCc2ccccc2-c2ccccc2)cc1C(F)(F)F
Show InChI InChI=1S/C34H29F3N2O3/c35-34(36,37)29-20-26(42-21-24-11-7-8-14-27(24)22-9-3-1-4-10-22)16-17-28(29)32-38-30-19-23(33(40)41)15-18-31(30)39(32)25-12-5-2-6-13-25/h1,3-4,7-11,14-20,25H,2,5-6,12-13,21H2,(H,40,41)
n/an/a 930n/an/an/an/an/an/a
Central Pharmaceutical Research Institute
Curated by ChEMBL
Assay Description
Inhibition of HCV 1b BK six His-tagged C-terminal truncated 544 amino acid NS5B RNA dependent RNA polymerase
J Med Chem 49: 4721-36 (2006)
Article DOI: 10.1021/jm060269e
BindingDB Entry DOI: 10.7270/Q2FN15TD
RNA-directed RNA polymerase
(Hepatitis C virus genotype 1)
BDBM50191535
(2-[4-(biphenyl-2-ylmethoxy)-2-trifluoromethylpheny...)
Show SMILES OC(=O)c1ccc2n(C3CCCCC3)c(nc2c1)-c1ccc(OCc2ccccc2-c2ccccc2)cc1C(F)(F)F
Show InChI InChI=1S/C34H29F3N2O3/c35-34(36,37)29-20-26(42-21-24-11-7-8-14-27(24)22-9-3-1-4-10-22)16-17-28(29)32-38-30-19-23(33(40)41)15-18-31(30)39(32)25-12-5-2-6-13-25/h1,3-4,7-11,14-20,25H,2,5-6,12-13,21H2,(H,40,41)
n/an/a 930n/an/an/an/an/an/a
TBA
Assay Description
Inhibition of Hepatitis C virus genotype 1 NS5B polymerases lacking C-terminal 47 amino acid residues expressed in Escherichia coli after 60 min
Citation and Details
Article DOI: 10.1007/s00044-012-0186-8
BindingDB Entry DOI: 10.7270/Q2NC6441
RNA-directed RNA polymerase
(Hepatitis C virus genotype 1)
BDBM50191535
(2-[4-(biphenyl-2-ylmethoxy)-2-trifluoromethylpheny...)
Show SMILES OC(=O)c1ccc2n(C3CCCCC3)c(nc2c1)-c1ccc(OCc2ccccc2-c2ccccc2)cc1C(F)(F)F
Show InChI InChI=1S/C34H29F3N2O3/c35-34(36,37)29-20-26(42-21-24-11-7-8-14-27(24)22-9-3-1-4-10-22)16-17-28(29)32-38-30-19-23(33(40)41)15-18-31(30)39(32)25-12-5-2-6-13-25/h1,3-4,7-11,14-20,25H,2,5-6,12-13,21H2,(H,40,41)
n/an/a 1.08E+6n/an/an/an/an/an/a
TBA
Assay Description
Inhibition of Hepatitis C virus genotype 1 NS5B polymerases lacking C-terminal 47 amino acid residues expressed in Escherichia coli after 60 min
Citation and Details
Article DOI: 10.1007/s00044-012-0186-8
BindingDB Entry DOI: 10.7270/Q2NC6441