BDBM50191537 2-[4-(4-benzylcarbamoyl-4'-chlorobiphenyl-2-ylmethoxy)phenyl]-1-cyclohexyl-1H-benzimidazole-5-carboxylic acid::CHEMBL209853
SMILES: OC(=O)c1ccc2n(C3CCCCC3)c(nc2c1)-c1ccc(OCc2cc(ccc2-c2ccc(Cl)cc2)C(=O)NCc2ccccc2)cc1
InChI Key: InChIKey=RLWMUNJYSAVUMR-UHFFFAOYSA-N
Data: 3 IC50
Activity Spreadsheet -- Enzyme Inhibition Constant Data from BindingDB
Found 3 hits for monomerid = 50191537
Trg + Lig
Ki
nM
ΔG°
kcal/mole
IC50
nM
Kd
nM
EC50/IC50
nM
koff
s-1
kon
M-1s-1
pHTemp
°C
Hepatitis C virus NS5B RNA-dependent RNA polymerase
(Hepatitis C virus)
BDBM50191537
(2-[4-(4-benzylcarbamoyl-4'-chlorobiphenyl-2-ylmeth...)
Show SMILES OC(=O)c1ccc2n(C3CCCCC3)c(nc2c1)-c1ccc(OCc2cc(ccc2-c2ccc(Cl)cc2)C(=O)NCc2ccccc2)cc1
Show InChI InChI=1S/C41H36ClN3O4/c42-33-17-11-28(12-18-33)36-21-15-30(40(46)43-25-27-7-3-1-4-8-27)23-32(36)26-49-35-19-13-29(14-20-35)39-44-37-24-31(41(47)48)16-22-38(37)45(39)34-9-5-2-6-10-34/h1,3-4,7-8,11-24,34H,2,5-6,9-10,25-26H2,(H,43,46)(H,47,48)
n/an/a 29n/an/an/an/an/an/a
Central Pharmaceutical Research Institute
Curated by ChEMBL
Assay Description
Inhibition of HCV 1b BK six His-tagged C-terminal truncated 544 amino acid NS5B RNA dependent RNA polymerase
J Med Chem 49: 4721-36 (2006)
Article DOI: 10.1021/jm060269e
BindingDB Entry DOI: 10.7270/Q2FN15TD
RNA-directed RNA polymerase
(Hepatitis C virus genotype 1)
BDBM50191537
(2-[4-(4-benzylcarbamoyl-4'-chlorobiphenyl-2-ylmeth...)
Show SMILES OC(=O)c1ccc2n(C3CCCCC3)c(nc2c1)-c1ccc(OCc2cc(ccc2-c2ccc(Cl)cc2)C(=O)NCc2ccccc2)cc1
Show InChI InChI=1S/C41H36ClN3O4/c42-33-17-11-28(12-18-33)36-21-15-30(40(46)43-25-27-7-3-1-4-8-27)23-32(36)26-49-35-19-13-29(14-20-35)39-44-37-24-31(41(47)48)16-22-38(37)45(39)34-9-5-2-6-10-34/h1,3-4,7-8,11-24,34H,2,5-6,9-10,25-26H2,(H,43,46)(H,47,48)
n/an/a 3.45E+7n/an/an/an/an/an/a
TBA
Assay Description
Inhibition of Hepatitis C virus genotype 1 NS5B polymerases lacking C-terminal 47 amino acid residues expressed in Escherichia coli after 60 min
Citation and Details
Article DOI: 10.1007/s00044-012-0186-8
BindingDB Entry DOI: 10.7270/Q2NC6441
RNA-directed RNA polymerase
(Hepatitis C virus genotype 1)
BDBM50191537
(2-[4-(4-benzylcarbamoyl-4'-chlorobiphenyl-2-ylmeth...)
Show SMILES OC(=O)c1ccc2n(C3CCCCC3)c(nc2c1)-c1ccc(OCc2cc(ccc2-c2ccc(Cl)cc2)C(=O)NCc2ccccc2)cc1
Show InChI InChI=1S/C41H36ClN3O4/c42-33-17-11-28(12-18-33)36-21-15-30(40(46)43-25-27-7-3-1-4-8-27)23-32(36)26-49-35-19-13-29(14-20-35)39-44-37-24-31(41(47)48)16-22-38(37)45(39)34-9-5-2-6-10-34/h1,3-4,7-8,11-24,34H,2,5-6,9-10,25-26H2,(H,43,46)(H,47,48)
n/an/a 29n/an/an/an/an/an/a
TBA
Assay Description
Inhibition of Hepatitis C virus genotype 1 NS5B polymerases lacking C-terminal 47 amino acid residues expressed in Escherichia coli after 60 min
Citation and Details
Article DOI: 10.1007/s00044-012-0186-8
BindingDB Entry DOI: 10.7270/Q2NC6441