BDBM50191543 2-{4-[4-(acetylisopropylamino)-4'-chlorobiphenyl-2-ylmethoxy]-2-fluorophenyl}-1-cyclohexyl-1H-benzimidazole-5-carboxylic acid::CHEMBL380002
SMILES: CC(C)N(C(C)=O)c1ccc(c(COc2ccc(-c3nc4cc(ccc4n3C3CCCCC3)C(O)=O)c(F)c2)c1)-c1ccc(Cl)cc1
InChI Key: InChIKey=POVCNXAUBXAKLO-UHFFFAOYSA-N
Data: 3 IC50
Activity Spreadsheet -- Enzyme Inhibition Constant Data from BindingDB
Found 3 hits for monomerid = 50191543
Trg + Lig
Ki
nM
ΔG°
kcal/mole
IC50
nM
Kd
nM
EC50/IC50
nM
koff
s-1
kon
M-1s-1
pHTemp
°C
Hepatitis C virus NS5B RNA-dependent RNA polymerase
(Hepatitis C virus)
BDBM50191543
(2-{4-[4-(acetylisopropylamino)-4'-chlorobiphenyl-2...)
Show SMILES CC(C)N(C(C)=O)c1ccc(c(COc2ccc(-c3nc4cc(ccc4n3C3CCCCC3)C(O)=O)c(F)c2)c1)-c1ccc(Cl)cc1
Show InChI InChI=1S/C38H37ClFN3O4/c1-23(2)42(24(3)44)30-14-16-32(25-9-12-28(39)13-10-25)27(19-30)22-47-31-15-17-33(34(40)21-31)37-41-35-20-26(38(45)46)11-18-36(35)43(37)29-7-5-4-6-8-29/h9-21,23,29H,4-8,22H2,1-3H3,(H,45,46)
n/an/a 21n/an/an/an/an/an/a
Central Pharmaceutical Research Institute
Curated by ChEMBL
Assay Description
Inhibition of HCV 1b BK six His-tagged C-terminal truncated 544 amino acid NS5B RNA dependent RNA polymerase
J Med Chem 49: 4721-36 (2006)
Article DOI: 10.1021/jm060269e
BindingDB Entry DOI: 10.7270/Q2FN15TD
RNA-directed RNA polymerase
(Hepatitis C virus genotype 1)
BDBM50191543
(2-{4-[4-(acetylisopropylamino)-4'-chlorobiphenyl-2...)
Show SMILES CC(C)N(C(C)=O)c1ccc(c(COc2ccc(-c3nc4cc(ccc4n3C3CCCCC3)C(O)=O)c(F)c2)c1)-c1ccc(Cl)cc1
Show InChI InChI=1S/C38H37ClFN3O4/c1-23(2)42(24(3)44)30-14-16-32(25-9-12-28(39)13-10-25)27(19-30)22-47-31-15-17-33(34(40)21-31)37-41-35-20-26(38(45)46)11-18-36(35)43(37)29-7-5-4-6-8-29/h9-21,23,29H,4-8,22H2,1-3H3,(H,45,46)
n/an/a 21n/an/an/an/an/an/a
TBA
Assay Description
Inhibition of Hepatitis C virus genotype 1 NS5B polymerases lacking C-terminal 47 amino acid residues expressed in Escherichia coli after 60 min
Citation and Details
Article DOI: 10.1007/s00044-012-0186-8
BindingDB Entry DOI: 10.7270/Q2NC6441
RNA-directed RNA polymerase
(Hepatitis C virus genotype 1)
BDBM50191543
(2-{4-[4-(acetylisopropylamino)-4'-chlorobiphenyl-2...)
Show SMILES CC(C)N(C(C)=O)c1ccc(c(COc2ccc(-c3nc4cc(ccc4n3C3CCCCC3)C(O)=O)c(F)c2)c1)-c1ccc(Cl)cc1
Show InChI InChI=1S/C38H37ClFN3O4/c1-23(2)42(24(3)44)30-14-16-32(25-9-12-28(39)13-10-25)27(19-30)22-47-31-15-17-33(34(40)21-31)37-41-35-20-26(38(45)46)11-18-36(35)43(37)29-7-5-4-6-8-29/h9-21,23,29H,4-8,22H2,1-3H3,(H,45,46)
n/an/a 4.76E+7n/an/an/an/an/an/a
TBA
Assay Description
Inhibition of Hepatitis C virus genotype 1 NS5B polymerases lacking C-terminal 47 amino acid residues expressed in Escherichia coli after 60 min
Citation and Details
Article DOI: 10.1007/s00044-012-0186-8
BindingDB Entry DOI: 10.7270/Q2NC6441