BDBM50191641 CHEMBL3949347
SMILES: CN(C)C\C=C\C(=O)Nc1cc2c(Nc3ccc4n(Cc5ccccc5)ncc4c3)ncnc2cn1
InChI Key: InChIKey=KZVDSZYFRUKCEQ-RMKNXTFCSA-N
Data: 5 IC50
Activity Spreadsheet -- Enzyme Inhibition Constant Data from BindingDB
Found 5 hits for monomerid = 50191641
Trg + Lig
Ki
nM
ΔG°
kcal/mole
IC50
nM
Kd
nM
EC50/IC50
nM
koff
s-1
kon
M-1s-1
pHTemp
°C
Tyrosine-protein kinase JAK3
(Homo sapiens (Human))
BDBM50191641
(CHEMBL3949347)
Show SMILES CN(C)C\C=C\C(=O)Nc1cc2c(Nc3ccc4n(Cc5ccccc5)ncc4c3)ncnc2cn1
Show InChI InChI=1S/C27H26N8O/c1-34(2)12-6-9-26(36)33-25-14-22-23(16-28-25)29-18-30-27(22)32-21-10-11-24-20(13-21)15-31-35(24)17-19-7-4-3-5-8-19/h3-11,13-16,18H,12,17H2,1-2H3,(H,28,33,36)(H,29,30,32)/b9-6+
Reactome pathway
n/an/a 7.44E+3n/an/an/an/an/an/a
University of Auckland
Curated by ChEMBL
Assay Description
Irreversible inhibition of human recombinant GST-tagged JAK3 expressed in baculovirus infected Sf9 insect cells assessed as reduction in polyglutamic...
J Med Chem 59: 8103-24 (2016)
BindingDB Entry DOI: 10.7270/Q2FF3VB3
Receptor tyrosine-protein kinase erbB-2
(Homo sapiens (Human))
BDBM50191641
(CHEMBL3949347)
Show SMILES CN(C)C\C=C\C(=O)Nc1cc2c(Nc3ccc4n(Cc5ccccc5)ncc4c3)ncnc2cn1
Show InChI InChI=1S/C27H26N8O/c1-34(2)12-6-9-26(36)33-25-14-22-23(16-28-25)29-18-30-27(22)32-21-10-11-24-20(13-21)15-31-35(24)17-19-7-4-3-5-8-19/h3-11,13-16,18H,12,17H2,1-2H3,(H,28,33,36)(H,29,30,32)/b9-6+
n/an/a 62n/an/an/an/an/an/a
University of Auckland
Curated by ChEMBL
Assay Description
Irreversible inhibition of GST-tagged ERBB2 (unknown origin) (Ile-675 to Val-1256 residues) expressed in baculovirus infected Sf9 insect cells assess...
J Med Chem 59: 8103-24 (2016)
BindingDB Entry DOI: 10.7270/Q2FF3VB3
Epidermal growth factor receptor
(Homo sapiens (Human))
BDBM50191641
(CHEMBL3949347)
Show SMILES CN(C)C\C=C\C(=O)Nc1cc2c(Nc3ccc4n(Cc5ccccc5)ncc4c3)ncnc2cn1
Show InChI InChI=1S/C27H26N8O/c1-34(2)12-6-9-26(36)33-25-14-22-23(16-28-25)29-18-30-27(22)32-21-10-11-24-20(13-21)15-31-35(24)17-19-7-4-3-5-8-19/h3-11,13-16,18H,12,17H2,1-2H3,(H,28,33,36)(H,29,30,32)/b9-6+
n/an/a 3n/an/an/an/an/an/a
University of Auckland
Curated by ChEMBL
Assay Description
Irreversible inhibition of full length human ERBB1 autophosphorylation transfected in EGF-stimulated mouse NIH/3T3 cells incubated for 2 hrs followed...
J Med Chem 59: 8103-24 (2016)
BindingDB Entry DOI: 10.7270/Q2FF3VB3
Epidermal growth factor receptor
(Homo sapiens (Human))
BDBM50191641
(CHEMBL3949347)
Show SMILES CN(C)C\C=C\C(=O)Nc1cc2c(Nc3ccc4n(Cc5ccccc5)ncc4c3)ncnc2cn1
Show InChI InChI=1S/C27H26N8O/c1-34(2)12-6-9-26(36)33-25-14-22-23(16-28-25)29-18-30-27(22)32-21-10-11-24-20(13-21)15-31-35(24)17-19-7-4-3-5-8-19/h3-11,13-16,18H,12,17H2,1-2H3,(H,28,33,36)(H,29,30,32)/b9-6+
n/an/a 41n/an/an/an/an/an/a
University of Auckland
Curated by ChEMBL
Assay Description
Irreversible inhibition of GST-tagged ERBB1 (unknown origin) (Met-668 to Ala-1211 residues) expressed in baculovirus infected Sf9 insect cells assess...
J Med Chem 59: 8103-24 (2016)
BindingDB Entry DOI: 10.7270/Q2FF3VB3
Receptor protein-tyrosine kinase erbB-4
(Homo sapiens (Human))
BDBM50191641
(CHEMBL3949347)
Show SMILES CN(C)C\C=C\C(=O)Nc1cc2c(Nc3ccc4n(Cc5ccccc5)ncc4c3)ncnc2cn1
Show InChI InChI=1S/C27H26N8O/c1-34(2)12-6-9-26(36)33-25-14-22-23(16-28-25)29-18-30-27(22)32-21-10-11-24-20(13-21)15-31-35(24)17-19-7-4-3-5-8-19/h3-11,13-16,18H,12,17H2,1-2H3,(H,28,33,36)(H,29,30,32)/b9-6+
n/an/a 3n/an/an/an/an/an/a
University of Auckland
Curated by ChEMBL
Assay Description
Irreversible inhibition of GST-tagged ERBB4 (unknown origin) (Gly-259 to Gly-690 residues) expressed in baculovirus infected Sf9 insect cells assesse...
J Med Chem 59: 8103-24 (2016)
BindingDB Entry DOI: 10.7270/Q2FF3VB3