BDBM50191678 CHEMBL3909782
SMILES: Clc1cc2ncc3ncn(-c4ccc(CC#N)cc4)c3c2cc1-c1ccsc1
InChI Key: InChIKey=OGTCPSIXXHWEKE-UHFFFAOYSA-N
Data: 1 IC50
Activity Spreadsheet -- Enzyme Inhibition Constant Data from BindingDB
Found 1 hit for monomerid = 50191678
Trg + Lig
Ki
nM
ΔG°
kcal/mole
IC50
nM
Kd
nM
EC50/IC50
nM
koff
s-1
kon
M-1s-1
pHTemp
°C
Mitogen-activated protein kinase kinase kinase 8
(Homo sapiens (Human))
BDBM50191678
(CHEMBL3909782)
Show SMILES Clc1cc2ncc3ncn(-c4ccc(CC#N)cc4)c3c2cc1-c1ccsc1
Show InChI InChI=1S/C22H13ClN4S/c23-19-10-20-18(9-17(19)15-6-8-28-12-15)22-21(11-25-20)26-13-27(22)16-3-1-14(2-4-16)5-7-24/h1-4,6,8-13H,5H2
NCI pathway
Reactome pathway
n/an/a 800n/an/an/an/an/an/a
Novartis Institutes for BioMedical Research
Curated by ChEMBL
Assay Description
Inhibition of human COT (66 to 395 residues) expressed in Sf21 cells using 5-Fluo-Ahx-AGAGSGQLIDSNleANSFVGTR-NH2 as substrate after 60 mins by calipe...
J Med Chem 59: 7544-60 (2016)
BindingDB Entry DOI: 10.7270/Q29P33MR