BDBM50191887 1-adamantan-1-yl-3-(1-propionyl-piperidin-4-yl)-urea::CHEMBL214943
SMILES: CCC(=O)N1CCC(CC1)NC(=O)NC12CC3CC(CC(C3)C1)C2
InChI Key: InChIKey=LFQPHKTUDTUJEA-UHFFFAOYSA-N
Data: 3 IC50
Activity Spreadsheet -- Enzyme Inhibition Constant Data from BindingDB
Found 3 hits for monomerid = 50191887
Trg + Lig
Ki
nM
ΔG°
kcal/mole
IC50
nM
Kd
nM
EC50/IC50
nM
koff
s-1
kon
M-1s-1
pHTemp
°C
EBifunctional epoxide hydrolase 2
(Homo sapiens (Human))
BDBM50191887
(1-adamantan-1-yl-3-(1-propionyl-piperidin-4-yl)-ur...)
Show SMILES CCC(=O)N1CCC(CC1)NC(=O)NC12CC3CC(CC(C3)C1)C2 |TLB:13:14:17.16.21:19,THB:15:16:19:23.14.22,15:14:17.16.21:19,22:14:17:21.20.19,22:20:17:23.15.14,13:14:17:21.20.19|
Show InChI InChI=1S/C19H31N3O2/c1-2-17(23)22-5-3-16(4-6-22)20-18(24)21-19-10-13-7-14(11-19)9-15(8-13)12-19/h13-16H,2-12H2,1H3,(H2,20,21,24)
n/an/a 3.20n/an/an/an/an/an/a
University of California
Curated by ChEMBL
Assay Description
Inhibition of soluble epoxide hydroxylase by kinetic fluorescent assay
Bioorg Med Chem Lett 16: 5212-6 (2006)
Article DOI: 10.1016/j.bmcl.2006.07.009
BindingDB Entry DOI: 10.7270/Q29023DS
EBifunctional epoxide hydrolase 2
(Homo sapiens (Human))
BDBM50191887
(1-adamantan-1-yl-3-(1-propionyl-piperidin-4-yl)-ur...)
Show SMILES CCC(=O)N1CCC(CC1)NC(=O)NC12CC3CC(CC(C3)C1)C2 |TLB:13:14:17.16.21:19,THB:15:16:19:23.14.22,15:14:17.16.21:19,22:14:17:21.20.19,22:20:17:23.15.14,13:14:17:21.20.19|
Show InChI InChI=1S/C19H31N3O2/c1-2-17(23)22-5-3-16(4-6-22)20-18(24)21-19-10-13-7-14(11-19)9-15(8-13)12-19/h13-16H,2-12H2,1H3,(H2,20,21,24)
n/an/a 2.80n/an/an/an/an/an/a
Department of Entomology and University of California Davis Cancer Center
Curated by ChEMBL
Assay Description
Inhibition of human recombinant soluble epoxide hydrolase by fluorescence assay
J Med Chem 53: 7067-75 (2010)
Article DOI: 10.1021/jm100691c
BindingDB Entry DOI: 10.7270/Q2GH9J6V
Soluble epoxide hydrolase (sEH)
(Mus musculus (Mouse))
BDBM50191887
(1-adamantan-1-yl-3-(1-propionyl-piperidin-4-yl)-ur...)
Show SMILES CCC(=O)N1CCC(CC1)NC(=O)NC12CC3CC(CC(C3)C1)C2 |TLB:13:14:17.16.21:19,THB:15:16:19:23.14.22,15:14:17.16.21:19,22:14:17:21.20.19,22:20:17:23.15.14,13:14:17:21.20.19|
Show InChI InChI=1S/C19H31N3O2/c1-2-17(23)22-5-3-16(4-6-22)20-18(24)21-19-10-13-7-14(11-19)9-15(8-13)12-19/h13-16H,2-12H2,1H3,(H2,20,21,24)
n/an/a 1.20n/an/an/an/an/an/a
Department of Entomology and University of California Davis Cancer Center
Curated by ChEMBL
Assay Description
Inhibition of mouse recombinant soluble epoxide hydrolase by fluorescence assay
J Med Chem 53: 7067-75 (2010)
Article DOI: 10.1021/jm100691c
BindingDB Entry DOI: 10.7270/Q2GH9J6V