BDBM50192068 Ac-Phe-[Orn-Pro-cha-Trp-Cit]::CHEMBL219236
SMILES: CC(=O)N[C@@H](Cc1ccccc1)C(=O)N[C@H]1CCCNC(=O)[C@H](CCCNC(N)=O)NC(=O)[C@H](Cc2c[nH]c3ccccc23)NC(=O)[C@@H](CC2CCCCC2)NC(=O)[C@@H]2CCCN2C1=O
InChI Key: InChIKey=NIQYJCLSMRFCFM-HPSWDUTRSA-N
Data: 1 IC50
Activity Spreadsheet -- Enzyme Inhibition Constant Data from BindingDB
Found 1 hit for monomerid = 50192068
Trg + Lig
Ki
nM
ΔG°
kcal/mole
IC50
nM
Kd
nM
EC50/IC50
nM
koff
s-1
kon
M-1s-1
pHTemp
°C
C5a anaphylatoxin chemotactic receptor (C5aR)
(Homo sapiens (Human))
BDBM50192068
(Ac-Phe-[Orn-Pro-cha-Trp-Cit] | CHEMBL219236)
Show SMILES CC(=O)N[C@@H](Cc1ccccc1)C(=O)N[C@H]1CCCNC(=O)[C@H](CCCNC(N)=O)NC(=O)[C@H](Cc2c[nH]c3ccccc23)NC(=O)[C@@H](CC2CCCCC2)NC(=O)[C@@H]2CCCN2C1=O
Show InChI InChI=1S/C47H64N10O8/c1-29(58)52-37(25-30-13-4-2-5-14-30)42(60)54-36-20-11-22-49-41(59)35(19-10-23-50-47(48)65)53-44(62)39(27-32-28-51-34-18-9-8-17-33(32)34)55-43(61)38(26-31-15-6-3-7-16-31)56-45(63)40-21-12-24-57(40)46(36)64/h2,4-5,8-9,13-14,17-18,28,31,35-40,51H,3,6-7,10-12,15-16,19-27H2,1H3,(H,49,59)(H,52,58)(H,53,62)(H,54,60)(H,55,61)(H,56,63)(H3,48,50,65)/t35-,36-,37-,38+,39-,40-/m0/s1
n/an/a 490n/an/an/an/an/an/a
Jerini AG
Curated by ChEMBL
Assay Description
Antagonist activity at human C5aR in CD88 transfected RBL cells assessed as inhibition of C5a-induced glucosaminidase release
Bioorg Med Chem Lett 16: 5088-92 (2006)
Article DOI: 10.1016/j.bmcl.2006.07.036
BindingDB Entry DOI: 10.7270/Q2RX9BP8