BDBM50192283 (S)-N-(5-(7-(2-hydroxy-3-(piperidin-1-yl)propoxy)-6-methoxyquinazolin-4-ylamino)pyrimidin-2-yl)benzamide::CHEMBL427212::N-{5-[(7-{[(2S)-2-HYDROXY-3-PIPERIDIN-1-YLPROPYL]OXY}-6-METHOXYQUINAZOLIN-4-YL)AMINO]PYRIMIDIN-2-YL}BENZAMIDE::S)-N-5-7-2-hydroxy-3-piperidin-1-yl)propoxy)-6-methoxyquinazolin-4-ylamino)pyrimidin-2-yl)benzamide
SMILES: COc1cc2c(Nc3cnc(NC(=O)c4ccccc4)nc3)ncnc2cc1OC[C@@H](O)CN1CCCCC1
InChI Key: InChIKey=WHHFZOIADLFZRX-NRFANRHFSA-N
Data: 1 IC50
PDB links: 1 PDB ID matches this monomer.
Activity Spreadsheet -- Enzyme Inhibition Constant Data from BindingDB
Found 1 hit for monomerid = 50192283
Trg + Lig
Ki
nM
ΔG°
kcal/mole
IC50
nM
Kd
nM
EC50/IC50
nM
koff
s-1
kon
M-1s-1
pHTemp
°C
Aurora kinase A
(Homo sapiens (Human))
BDBM50192283
((S)-N-(5-(7-(2-hydroxy-3-(piperidin-1-yl)propoxy)-...)
Show SMILES COc1cc2c(Nc3cnc(NC(=O)c4ccccc4)nc3)ncnc2cc1OC[C@@H](O)CN1CCCCC1
Show InChI InChI=1S/C28H31N7O4/c1-38-24-12-22-23(13-25(24)39-17-21(36)16-35-10-6-3-7-11-35)31-18-32-26(22)33-20-14-29-28(30-15-20)34-27(37)19-8-4-2-5-9-19/h2,4-5,8-9,12-15,18,21,36H,3,6-7,10-11,16-17H2,1H3,(H,31,32,33)(H,29,30,34,37)/t21-/m0/s1
NCI pathway
Reactome pathway
n/an/a 0.800n/an/an/an/an/an/a
AstraZeneca R&D Boston
Curated by ChEMBL
Assay Description
Inhibition of Aurora A
J Med Chem 49: 4805-8 (2006)
Article DOI: 10.1021/jm060522a
BindingDB Entry DOI: 10.7270/Q2QZ29KW
3D
3D Structure (crystal)