BDBM50192287 CHEMBL212868::N-[(5R,6R,8R,9R)-9-(tert-butyl-dimethyl-silanyloxy)-6-(tert-butyl-dimethyl-silanyloxymethyl)-8-(5-methyl-2,4-dioxo-3,4-dihydro-2H-pyrimidin-1-yl)-2,2-dioxo-1,7-dioxa-2lambda*6*-thia-spiro[4.4]non-3-en-4-yl]-guanidine
SMILES: Cc1cn([C@@H]2O[C@H](CO[Si](C)(C)C(C)(C)C)[C@@]3(OS(=O)(=O)C=C3N=C(N)N)[C@H]2O[Si](C)(C)C(C)(C)C)c(=O)[nH]c1=O
InChI Key: InChIKey=IMWUOEGBNSIZDY-MHDHIAOQSA-N
Data: 2 IC50
Activity Spreadsheet -- Enzyme Inhibition Constant Data from BindingDB
Found 2 hits for monomerid = 50192287
Trg + Lig
Ki
nM
ΔG°
kcal/mole
IC50
nM
Kd
nM
EC50/IC50
nM
koff
s-1
kon
M-1s-1
pHTemp
°C
Human immunodeficiency virus type 1 reverse transcriptase
(Human immunodeficiency virus 1)
BDBM50192287
(CHEMBL212868 | N-[(5R,6R,8R,9R)-9-(tert-butyl-dime...)
Show SMILES Cc1cn([C@@H]2O[C@H](CO[Si](C)(C)C(C)(C)C)[C@@]3(OS(=O)(=O)C=C3N=C(N)N)[C@H]2O[Si](C)(C)C(C)(C)C)c(=O)[nH]c1=O |wU:4.3,6.6,wD:16.16,27.29,c:21,(26.69,-32.35,;25.2,-31.95,;24.12,-33.04,;22.64,-32.64,;21.56,-33.73,;20.02,-33.5,;19.34,-34.88,;17.8,-34.88,;17.04,-33.54,;15.49,-33.54,;15.49,-35.08,;15.49,-32.01,;13.96,-33.54,;12.42,-33.54,;13.96,-35.08,;13.96,-32.01,;20.45,-35.94,;21.56,-37.01,;20.89,-38.38,;20.52,-39.88,;22.35,-38.9,;19.37,-38.17,;19.09,-36.64,;17.61,-36.21,;16.5,-37.28,;15.01,-36.85,;16.86,-38.78,;21.82,-35.23,;23.61,-36.11,;24.9,-35.27,;25.75,-36.55,;24.05,-33.98,;26.18,-34.41,;27.03,-35.69,;25.32,-33.13,;27.46,-33.56,;22.23,-31.16,;20.73,-30.77,;23.32,-30.07,;24.8,-30.47,;25.9,-29.37,)|
Show InChI InChI=1S/C25H45N5O8SSi2/c1-15-12-30(22(32)29-19(15)31)20-18(37-41(10,11)24(5,6)7)25(16(28-21(26)27)14-39(33,34)38-25)17(36-20)13-35-40(8,9)23(2,3)4/h12,14,17-18,20H,13H2,1-11H3,(H4,26,27,28)(H,29,31,32)/t17-,18+,20-,25-/m1/s1
n/an/a 3.80E+3n/an/an/an/an/an/a
University of Pittsburgh School of Medicine
Curated by ChEMBL
Assay Description
Inhibition of HIV1 reverse transcriptase RNA-dependent DNA polymerase activity
J Med Chem 49: 4834-41 (2006)
Article DOI: 10.1021/jm0604575
BindingDB Entry DOI: 10.7270/Q2GH9HKC
Human immunodeficiency virus type 1 reverse transcriptase
(Human immunodeficiency virus 1)
BDBM50192287
(CHEMBL212868 | N-[(5R,6R,8R,9R)-9-(tert-butyl-dime...)
Show SMILES Cc1cn([C@@H]2O[C@H](CO[Si](C)(C)C(C)(C)C)[C@@]3(OS(=O)(=O)C=C3N=C(N)N)[C@H]2O[Si](C)(C)C(C)(C)C)c(=O)[nH]c1=O |wU:4.3,6.6,wD:16.16,27.29,c:21,(26.69,-32.35,;25.2,-31.95,;24.12,-33.04,;22.64,-32.64,;21.56,-33.73,;20.02,-33.5,;19.34,-34.88,;17.8,-34.88,;17.04,-33.54,;15.49,-33.54,;15.49,-35.08,;15.49,-32.01,;13.96,-33.54,;12.42,-33.54,;13.96,-35.08,;13.96,-32.01,;20.45,-35.94,;21.56,-37.01,;20.89,-38.38,;20.52,-39.88,;22.35,-38.9,;19.37,-38.17,;19.09,-36.64,;17.61,-36.21,;16.5,-37.28,;15.01,-36.85,;16.86,-38.78,;21.82,-35.23,;23.61,-36.11,;24.9,-35.27,;25.75,-36.55,;24.05,-33.98,;26.18,-34.41,;27.03,-35.69,;25.32,-33.13,;27.46,-33.56,;22.23,-31.16,;20.73,-30.77,;23.32,-30.07,;24.8,-30.47,;25.9,-29.37,)|
Show InChI InChI=1S/C25H45N5O8SSi2/c1-15-12-30(22(32)29-19(15)31)20-18(37-41(10,11)24(5,6)7)25(16(28-21(26)27)14-39(33,34)38-25)17(36-20)13-35-40(8,9)23(2,3)4/h12,14,17-18,20H,13H2,1-11H3,(H4,26,27,28)(H,29,31,32)/t17-,18+,20-,25-/m1/s1
n/an/a 1.40E+4n/an/an/an/an/an/a
University of Pittsburgh School of Medicine
Curated by ChEMBL
Assay Description
Inhibition of FLAG-p66/HIS-p51-mediated HIV1 reverse transcriptase dimerization
J Med Chem 49: 4834-41 (2006)
Article DOI: 10.1021/jm0604575
BindingDB Entry DOI: 10.7270/Q2GH9HKC