BDBM50192320 CHEMBL3946901
SMILES: Cn1c(SCCCN2CC[C@]3(C[C@@H]3c3ccc(cc3)C(F)(F)F)C2)nnc1-c1ccccn1
InChI Key: InChIKey=BGJXBVUWLFEJNM-XXBNENTESA-N
Data: 4 KI  2 IC50
Activity Spreadsheet -- Enzyme Inhibition Constant Data from BindingDB
Found 6 hits for monomerid = 50192320
Trg + Lig
Ki
nM
ΔG°
kcal/mole
IC50
nM
Kd
nM
EC50/IC50
nM
koff
s-1
kon
M-1s-1
pHTemp
°C
D(3) dopamine receptor
(Homo sapiens (Human))
BDBM50192320
(CHEMBL3946901)
Show SMILES Cn1c(SCCCN2CC[C@]3(C[C@@H]3c3ccc(cc3)C(F)(F)F)C2)nnc1-c1ccccn1 |r|
Show InChI InChI=1S/C24H26F3N5S/c1-31-21(20-5-2-3-11-28-20)29-30-22(31)33-14-4-12-32-13-10-23(16-32)15-19(23)17-6-8-18(9-7-17)24(25,26)27/h2-3,5-9,11,19H,4,10,12-16H2,1H3/t19-,23+/m1/s1
0.794n/an/an/an/an/an/an/an/a
Aptuit s.r.l.
Curated by ChEMBL
Assay Description
Displacement of [3H]-spiperone from human dopamine D3 receptor expressed in CHO-K1 cell membranes after 90 mins by liquid scintillation counting
J Med Chem 59: 8549-76 (2016)
BindingDB Entry DOI: 10.7270/Q2SQ9298
D(3) dopamine receptor
(Homo sapiens (Human))
BDBM50192320
(CHEMBL3946901)
Show SMILES Cn1c(SCCCN2CC[C@]3(C[C@@H]3c3ccc(cc3)C(F)(F)F)C2)nnc1-c1ccccn1 |r|
Show InChI InChI=1S/C24H26F3N5S/c1-31-21(20-5-2-3-11-28-20)29-30-22(31)33-14-4-12-32-13-10-23(16-32)15-19(23)17-6-8-18(9-7-17)24(25,26)27/h2-3,5-9,11,19H,4,10,12-16H2,1H3/t19-,23+/m1/s1
0.794n/an/an/an/an/an/an/an/a
Aptuit s.r.l.
Curated by ChEMBL
Assay Description
Antagonist activity at human dopamine D3 receptor expressed in CHO cell membranes after 90 mins in presence of quinelorane by [35S]-GTPgammaS binding...
J Med Chem 59: 8549-76 (2016)
BindingDB Entry DOI: 10.7270/Q2SQ9298
D(2) dopamine receptor
(Homo sapiens (Human))
BDBM50192320
(CHEMBL3946901)
Show SMILES Cn1c(SCCCN2CC[C@]3(C[C@@H]3c3ccc(cc3)C(F)(F)F)C2)nnc1-c1ccccn1 |r|
Show InChI InChI=1S/C24H26F3N5S/c1-31-21(20-5-2-3-11-28-20)29-30-22(31)33-14-4-12-32-13-10-23(16-32)15-19(23)17-6-8-18(9-7-17)24(25,26)27/h2-3,5-9,11,19H,4,10,12-16H2,1H3/t19-,23+/m1/s1
Reactome pathway
107n/an/an/an/an/an/an/an/a
Aptuit s.r.l.
Curated by ChEMBL
Assay Description
Antagonist activity at human dopamine D2L receptor expressed in CHO cells coexpressing Galpha16 assessed as inhibition of dopamine-induced Ca2+ stimu...
J Med Chem 59: 8549-76 (2016)
BindingDB Entry DOI: 10.7270/Q2SQ9298
D(2) dopamine receptor
(Homo sapiens (Human))
BDBM50192320
(CHEMBL3946901)
Show SMILES Cn1c(SCCCN2CC[C@]3(C[C@@H]3c3ccc(cc3)C(F)(F)F)C2)nnc1-c1ccccn1 |r|
Show InChI InChI=1S/C24H26F3N5S/c1-31-21(20-5-2-3-11-28-20)29-30-22(31)33-14-4-12-32-13-10-23(16-32)15-19(23)17-6-8-18(9-7-17)24(25,26)27/h2-3,5-9,11,19H,4,10,12-16H2,1H3/t19-,23+/m1/s1
Reactome pathway
525n/an/an/an/an/an/an/an/a
Aptuit s.r.l.
Curated by ChEMBL
Assay Description
Displacement of [3H]-spiperone from human dopamine D2 receptor expressed in CHO-K1 cell membranes coexpressing Galpha16 after 120 mins by liquid scin...
J Med Chem 59: 8549-76 (2016)
BindingDB Entry DOI: 10.7270/Q2SQ9298
1,3-beta-glucan synthase component GLS2
(Saccharomyces cerevisiae)
BDBM50192320
(CHEMBL3946901)
Show SMILES Cn1c(SCCCN2CC[C@]3(C[C@@H]3c3ccc(cc3)C(F)(F)F)C2)nnc1-c1ccccn1 |r|
Show InChI InChI=1S/C24H26F3N5S/c1-31-21(20-5-2-3-11-28-20)29-30-22(31)33-14-4-12-32-13-10-23(16-32)15-19(23)17-6-8-18(9-7-17)24(25,26)27/h2-3,5-9,11,19H,4,10,12-16H2,1H3/t19-,23+/m1/s1
n/an/a 200n/an/an/an/an/an/a
Aptuit s.r.l.
Curated by ChEMBL
Assay Description
Inhibition of human ERG transfected in HEK293 cells assessed as reduction in tail current by patch clamp assay
J Med Chem 59: 8549-76 (2016)
BindingDB Entry DOI: 10.7270/Q2SQ9298
1,3-beta-glucan synthase component GLS2
(Saccharomyces cerevisiae)
BDBM50192320
(CHEMBL3946901)
Show SMILES Cn1c(SCCCN2CC[C@]3(C[C@@H]3c3ccc(cc3)C(F)(F)F)C2)nnc1-c1ccccn1 |r|
Show InChI InChI=1S/C24H26F3N5S/c1-31-21(20-5-2-3-11-28-20)29-30-22(31)33-14-4-12-32-13-10-23(16-32)15-19(23)17-6-8-18(9-7-17)24(25,26)27/h2-3,5-9,11,19H,4,10,12-16H2,1H3/t19-,23+/m1/s1
n/an/a 209n/an/an/an/an/an/a
Aptuit s.r.l.
Curated by ChEMBL
Assay Description
Inhibition of human ERG transfected in HEK293 cells assessed as reduction in tail current by patch clamp assay
J Med Chem 59: 8549-76 (2016)
BindingDB Entry DOI: 10.7270/Q2SQ9298