BDBM50192352 9-hydroxy-4-(3-nitrophenyl)pyrrolo[3,4-c]carbazole-1,3(2H,6H)-dione::CHEMBL379592
SMILES: Oc1ccc2[nH]c3cc(c4C(=O)NC(=O)c4c3c2c1)-c1cccc(c1)[N+]([O-])=O
InChI Key: InChIKey=ISEUMWMDMLSCAS-UHFFFAOYSA-N
Data: 3 IC50
Activity Spreadsheet -- Enzyme Inhibition Constant Data from BindingDB
Found 3 hits for monomerid = 50192352
Trg + Lig
Ki
nM
ΔG°
kcal/mole
IC50
nM
Kd
nM
EC50/IC50
nM
koff
s-1
kon
M-1s-1
pHTemp
°C
Serine/threonine-protein kinase Chk1
(Homo sapiens (Human))
BDBM50192352
(9-hydroxy-4-(3-nitrophenyl)pyrrolo[3,4-c]carbazole...)
Show SMILES Oc1ccc2[nH]c3cc(c4C(=O)NC(=O)c4c3c2c1)-c1cccc(c1)[N+]([O-])=O
Show InChI InChI=1S/C20H11N3O5/c24-11-4-5-14-13(7-11)16-15(21-14)8-12(17-18(16)20(26)22-19(17)25)9-2-1-3-10(6-9)23(27)28/h1-8,21,24H,(H,22,25,26)
Reactome pathway
n/an/a>1.00E+4n/an/an/an/an/an/a
University of Auckland
Curated by ChEMBL
Assay Description
Inhibition at human Chk1 in presence of 4 uM ATP
J Med Chem 49: 4896-911 (2006)
Article DOI: 10.1021/jm0512591
BindingDB Entry DOI: 10.7270/Q23778BD
Serine/threonine-protein kinase WEE1
(Homo sapiens (Human))
BDBM50192352
(9-hydroxy-4-(3-nitrophenyl)pyrrolo[3,4-c]carbazole...)
Show SMILES Oc1ccc2[nH]c3cc(c4C(=O)NC(=O)c4c3c2c1)-c1cccc(c1)[N+]([O-])=O
Show InChI InChI=1S/C20H11N3O5/c24-11-4-5-14-13(7-11)16-15(21-14)8-12(17-18(16)20(26)22-19(17)25)9-2-1-3-10(6-9)23(27)28/h1-8,21,24H,(H,22,25,26)
NCI pathway
Reactome pathway
n/an/a 300n/an/an/an/an/an/a
Chulalongkorn University
Curated by ChEMBL
Assay Description
Inhibition of human Wee1
Eur J Med Chem 44: 1383-95 (2009)
Article DOI: 10.1016/j.ejmech.2008.09.027
BindingDB Entry DOI: 10.7270/Q2X34XB6
Serine/threonine-protein kinase WEE1
(Homo sapiens (Human))
BDBM50192352
(9-hydroxy-4-(3-nitrophenyl)pyrrolo[3,4-c]carbazole...)
Show SMILES Oc1ccc2[nH]c3cc(c4C(=O)NC(=O)c4c3c2c1)-c1cccc(c1)[N+]([O-])=O
Show InChI InChI=1S/C20H11N3O5/c24-11-4-5-14-13(7-11)16-15(21-14)8-12(17-18(16)20(26)22-19(17)25)9-2-1-3-10(6-9)23(27)28/h1-8,21,24H,(H,22,25,26)
NCI pathway
Reactome pathway
n/an/a 300n/an/an/an/an/an/a
University of Auckland
Curated by ChEMBL
Assay Description
Inhibition of human Wee1 in presence of 9.5 uM ATP
J Med Chem 49: 4896-911 (2006)
Article DOI: 10.1021/jm0512591
BindingDB Entry DOI: 10.7270/Q23778BD