BDBM50192358 9-hydroxy-4-(3-methoxyphenyl)pyrrolo[3,4-c]carbazole-1,3(2H,6H)-dione::CHEMBL213475
SMILES: COc1cccc(c1)-c1cc2[nH]c3ccc(O)cc3c2c2C(=O)NC(=O)c12
InChI Key: InChIKey=LEUYNDGCTDJNAH-UHFFFAOYSA-N
Data: 3 IC50
Activity Spreadsheet -- Enzyme Inhibition Constant Data from BindingDB
Found 3 hits for monomerid = 50192358
Trg + Lig
Ki
nM
ΔG°
kcal/mole
IC50
nM
Kd
nM
EC50/IC50
nM
koff
s-1
kon
M-1s-1
pHTemp
°C
Serine/threonine-protein kinase Chk1
(Homo sapiens (Human))
BDBM50192358
(9-hydroxy-4-(3-methoxyphenyl)pyrrolo[3,4-c]carbazo...)
Show SMILES COc1cccc(c1)-c1cc2[nH]c3ccc(O)cc3c2c2C(=O)NC(=O)c12
Show InChI InChI=1S/C21H14N2O4/c1-27-12-4-2-3-10(7-12)13-9-16-17(19-18(13)20(25)23-21(19)26)14-8-11(24)5-6-15(14)22-16/h2-9,22,24H,1H3,(H,23,25,26)
Reactome pathway
n/an/a 2.20E+3n/an/an/an/an/an/a
University of Auckland
Curated by ChEMBL
Assay Description
Inhibition at human Chk1 in presence of 4 uM ATP
J Med Chem 49: 4896-911 (2006)
Article DOI: 10.1021/jm0512591
BindingDB Entry DOI: 10.7270/Q23778BD
Serine/threonine-protein kinase WEE1
(Homo sapiens (Human))
BDBM50192358
(9-hydroxy-4-(3-methoxyphenyl)pyrrolo[3,4-c]carbazo...)
Show SMILES COc1cccc(c1)-c1cc2[nH]c3ccc(O)cc3c2c2C(=O)NC(=O)c12
Show InChI InChI=1S/C21H14N2O4/c1-27-12-4-2-3-10(7-12)13-9-16-17(19-18(13)20(25)23-21(19)26)14-8-11(24)5-6-15(14)22-16/h2-9,22,24H,1H3,(H,23,25,26)
NCI pathway
Reactome pathway
n/an/a 620n/an/an/an/an/an/a
Chulalongkorn University
Curated by ChEMBL
Assay Description
Inhibition of human Wee1
Eur J Med Chem 44: 1383-95 (2009)
Article DOI: 10.1016/j.ejmech.2008.09.027
BindingDB Entry DOI: 10.7270/Q2X34XB6
Serine/threonine-protein kinase WEE1
(Homo sapiens (Human))
BDBM50192358
(9-hydroxy-4-(3-methoxyphenyl)pyrrolo[3,4-c]carbazo...)
Show SMILES COc1cccc(c1)-c1cc2[nH]c3ccc(O)cc3c2c2C(=O)NC(=O)c12
Show InChI InChI=1S/C21H14N2O4/c1-27-12-4-2-3-10(7-12)13-9-16-17(19-18(13)20(25)23-21(19)26)14-8-11(24)5-6-15(14)22-16/h2-9,22,24H,1H3,(H,23,25,26)
NCI pathway
Reactome pathway
n/an/a 620n/an/an/an/an/an/a
University of Auckland
Curated by ChEMBL
Assay Description
Inhibition of human Wee1 in presence of 9.5 uM ATP
J Med Chem 49: 4896-911 (2006)
Article DOI: 10.1021/jm0512591
BindingDB Entry DOI: 10.7270/Q23778BD