BDBM50192364 9-hydroxy-4-(3-pyridinyl)pyrrolo[3,4-c]carbazole-1,3(2H,6H)-dione::9-hydroxy-4-(pyridin-3-yl)pyrrolo[3,4-c]carbazole-1,3(2H,6H)-dione::CHEMBL214172
SMILES: Oc1ccc2[nH]c3cc(c4C(=O)NC(=O)c4c3c2c1)-c1cccnc1
InChI Key: InChIKey=CDCUQSKHGUQLSL-UHFFFAOYSA-N
Data: 3 IC50
Activity Spreadsheet -- Enzyme Inhibition Constant Data from BindingDB
Found 3 hits for monomerid = 50192364
Trg + Lig
Ki
nM
ΔG°
kcal/mole
IC50
nM
Kd
nM
EC50/IC50
nM
koff
s-1
kon
M-1s-1
pHTemp
°C
Serine/threonine-protein kinase Chk1
(Homo sapiens (Human))
BDBM50192364
(9-hydroxy-4-(3-pyridinyl)pyrrolo[3,4-c]carbazole-1...)
Show SMILES Oc1ccc2[nH]c3cc(c4C(=O)NC(=O)c4c3c2c1)-c1cccnc1
Show InChI InChI=1S/C19H11N3O3/c23-10-3-4-13-12(6-10)15-14(21-13)7-11(9-2-1-5-20-8-9)16-17(15)19(25)22-18(16)24/h1-8,21,23H,(H,22,24,25)
Reactome pathway
n/an/a 2.30E+3n/an/an/an/an/an/a
University of Auckland
Curated by ChEMBL
Assay Description
Inhibition at human Chk1 in presence of 4 uM ATP
J Med Chem 49: 4896-911 (2006)
Article DOI: 10.1021/jm0512591
BindingDB Entry DOI: 10.7270/Q23778BD
Serine/threonine-protein kinase WEE1
(Homo sapiens (Human))
BDBM50192364
(9-hydroxy-4-(3-pyridinyl)pyrrolo[3,4-c]carbazole-1...)
Show SMILES Oc1ccc2[nH]c3cc(c4C(=O)NC(=O)c4c3c2c1)-c1cccnc1
Show InChI InChI=1S/C19H11N3O3/c23-10-3-4-13-12(6-10)15-14(21-13)7-11(9-2-1-5-20-8-9)16-17(15)19(25)22-18(16)24/h1-8,21,23H,(H,22,24,25)
NCI pathway
Reactome pathway
n/an/a 580n/an/an/an/an/an/a
Chulalongkorn University
Curated by ChEMBL
Assay Description
Inhibition of human Wee1
Eur J Med Chem 44: 1383-95 (2009)
Article DOI: 10.1016/j.ejmech.2008.09.027
BindingDB Entry DOI: 10.7270/Q2X34XB6
Serine/threonine-protein kinase WEE1
(Homo sapiens (Human))
BDBM50192364
(9-hydroxy-4-(3-pyridinyl)pyrrolo[3,4-c]carbazole-1...)
Show SMILES Oc1ccc2[nH]c3cc(c4C(=O)NC(=O)c4c3c2c1)-c1cccnc1
Show InChI InChI=1S/C19H11N3O3/c23-10-3-4-13-12(6-10)15-14(21-13)7-11(9-2-1-5-20-8-9)16-17(15)19(25)22-18(16)24/h1-8,21,23H,(H,22,24,25)
NCI pathway
Reactome pathway
n/an/a 580n/an/an/an/an/an/a
University of Auckland
Curated by ChEMBL
Assay Description
Inhibition of human Wee1 in presence of 9.5 uM ATP
J Med Chem 49: 4896-911 (2006)
Article DOI: 10.1021/jm0512591
BindingDB Entry DOI: 10.7270/Q23778BD