BDBM50192394 4-(2,6-dimethoxyphenyl)-9-hydroxypyrrolo[3,4-c]carbazole-1,3(2H,6H)-dione::CHEMBL386199
SMILES: COc1cccc(OC)c1-c1cc2[nH]c3ccc(O)cc3c2c2C(=O)NC(=O)c12
InChI Key: InChIKey=OKFAPHHECMHBEH-UHFFFAOYSA-N
Data: 3 IC50
Activity Spreadsheet -- Enzyme Inhibition Constant Data from BindingDB
Found 3 hits for monomerid = 50192394
Trg + Lig
Ki
nM
ΔG°
kcal/mole
IC50
nM
Kd
nM
EC50/IC50
nM
koff
s-1
kon
M-1s-1
pHTemp
°C
Serine/threonine-protein kinase Chk1
(Homo sapiens (Human))
BDBM50192394
(4-(2,6-dimethoxyphenyl)-9-hydroxypyrrolo[3,4-c]car...)
Show SMILES COc1cccc(OC)c1-c1cc2[nH]c3ccc(O)cc3c2c2C(=O)NC(=O)c12 |(18.36,-14.01,;19.89,-13.84,;20.51,-12.44,;22.04,-12.27,;22.67,-10.86,;21.75,-9.62,;20.22,-9.79,;19.31,-8.55,;19.93,-7.14,;19.61,-11.19,;18.09,-11.36,;17.45,-12.77,;15.92,-12.93,;15.01,-14.18,;13.54,-13.7,;12.2,-14.47,;10.87,-13.7,;10.87,-12.16,;9.54,-11.39,;12.2,-11.39,;13.53,-12.15,;15.01,-11.67,;15.64,-10.26,;15.01,-8.86,;13.51,-8.54,;16.16,-7.83,;17.49,-8.61,;18.89,-7.98,;17.16,-10.11,)|
Show InChI InChI=1S/C22H16N2O5/c1-28-15-4-3-5-16(29-2)18(15)12-9-14-17(20-19(12)21(26)24-22(20)27)11-8-10(25)6-7-13(11)23-14/h3-9,23,25H,1-2H3,(H,24,26,27)
Reactome pathway
n/an/a 5.30E+3n/an/an/an/an/an/a
University of Auckland
Curated by ChEMBL
Assay Description
Inhibition at human Chk1 in presence of 4 uM ATP
J Med Chem 49: 4896-911 (2006)
Article DOI: 10.1021/jm0512591
BindingDB Entry DOI: 10.7270/Q23778BD
Serine/threonine-protein kinase WEE1
(Homo sapiens (Human))
BDBM50192394
(4-(2,6-dimethoxyphenyl)-9-hydroxypyrrolo[3,4-c]car...)
Show SMILES COc1cccc(OC)c1-c1cc2[nH]c3ccc(O)cc3c2c2C(=O)NC(=O)c12 |(18.36,-14.01,;19.89,-13.84,;20.51,-12.44,;22.04,-12.27,;22.67,-10.86,;21.75,-9.62,;20.22,-9.79,;19.31,-8.55,;19.93,-7.14,;19.61,-11.19,;18.09,-11.36,;17.45,-12.77,;15.92,-12.93,;15.01,-14.18,;13.54,-13.7,;12.2,-14.47,;10.87,-13.7,;10.87,-12.16,;9.54,-11.39,;12.2,-11.39,;13.53,-12.15,;15.01,-11.67,;15.64,-10.26,;15.01,-8.86,;13.51,-8.54,;16.16,-7.83,;17.49,-8.61,;18.89,-7.98,;17.16,-10.11,)|
Show InChI InChI=1S/C22H16N2O5/c1-28-15-4-3-5-16(29-2)18(15)12-9-14-17(20-19(12)21(26)24-22(20)27)11-8-10(25)6-7-13(11)23-14/h3-9,23,25H,1-2H3,(H,24,26,27)
NCI pathway
Reactome pathway
n/an/a 27n/an/an/an/an/an/a
Chulalongkorn University
Curated by ChEMBL
Assay Description
Inhibition of human Wee1
Eur J Med Chem 44: 1383-95 (2009)
Article DOI: 10.1016/j.ejmech.2008.09.027
BindingDB Entry DOI: 10.7270/Q2X34XB6
Serine/threonine-protein kinase WEE1
(Homo sapiens (Human))
BDBM50192394
(4-(2,6-dimethoxyphenyl)-9-hydroxypyrrolo[3,4-c]car...)
Show SMILES COc1cccc(OC)c1-c1cc2[nH]c3ccc(O)cc3c2c2C(=O)NC(=O)c12 |(18.36,-14.01,;19.89,-13.84,;20.51,-12.44,;22.04,-12.27,;22.67,-10.86,;21.75,-9.62,;20.22,-9.79,;19.31,-8.55,;19.93,-7.14,;19.61,-11.19,;18.09,-11.36,;17.45,-12.77,;15.92,-12.93,;15.01,-14.18,;13.54,-13.7,;12.2,-14.47,;10.87,-13.7,;10.87,-12.16,;9.54,-11.39,;12.2,-11.39,;13.53,-12.15,;15.01,-11.67,;15.64,-10.26,;15.01,-8.86,;13.51,-8.54,;16.16,-7.83,;17.49,-8.61,;18.89,-7.98,;17.16,-10.11,)|
Show InChI InChI=1S/C22H16N2O5/c1-28-15-4-3-5-16(29-2)18(15)12-9-14-17(20-19(12)21(26)24-22(20)27)11-8-10(25)6-7-13(11)23-14/h3-9,23,25H,1-2H3,(H,24,26,27)
NCI pathway
Reactome pathway
n/an/a 27n/an/an/an/an/an/a
University of Auckland
Curated by ChEMBL
Assay Description
Inhibition of human Wee1 in presence of 9.5 uM ATP
J Med Chem 49: 4896-911 (2006)
Article DOI: 10.1021/jm0512591
BindingDB Entry DOI: 10.7270/Q23778BD