BDBM50192410 9-hydroxy-4-(2-(trifluoromethyl)phenyl)pyrrolo[3,4-c]carbazole-1,3(2H,6H)-dione::9-hydroxy-4-[(2-trifluoromethylphenyl)]pyrrolo[3,4-c]carbazole-1,3(2H,6H)-dione::CHEMBL212659
SMILES: Oc1ccc2[nH]c3cc(c4C(=O)NC(=O)c4c3c2c1)-c1ccccc1C(F)(F)F
InChI Key: InChIKey=LLSKCTDKJYZJNL-UHFFFAOYSA-N
Data: 3 IC50
Activity Spreadsheet -- Enzyme Inhibition Constant Data from BindingDB
Found 3 hits for monomerid = 50192410
Trg + Lig
Ki
nM
ΔG°
kcal/mole
IC50
nM
Kd
nM
EC50/IC50
nM
koff
s-1
kon
M-1s-1
pHTemp
°C
Serine/threonine-protein kinase Chk1
(Homo sapiens (Human))
BDBM50192410
(9-hydroxy-4-(2-(trifluoromethyl)phenyl)pyrrolo[3,4...)
Show SMILES Oc1ccc2[nH]c3cc(c4C(=O)NC(=O)c4c3c2c1)-c1ccccc1C(F)(F)F
Show InChI InChI=1S/C21H11F3N2O3/c22-21(23,24)13-4-2-1-3-10(13)11-8-15-16(18-17(11)19(28)26-20(18)29)12-7-9(27)5-6-14(12)25-15/h1-8,25,27H,(H,26,28,29)
Reactome pathway
n/an/a 1.00E+4n/an/an/an/an/an/a
University of Auckland
Curated by ChEMBL
Assay Description
Inhibition at human Chk1 in presence of 4 uM ATP
J Med Chem 49: 4896-911 (2006)
Article DOI: 10.1021/jm0512591
BindingDB Entry DOI: 10.7270/Q23778BD
Serine/threonine-protein kinase WEE1
(Homo sapiens (Human))
BDBM50192410
(9-hydroxy-4-(2-(trifluoromethyl)phenyl)pyrrolo[3,4...)
Show SMILES Oc1ccc2[nH]c3cc(c4C(=O)NC(=O)c4c3c2c1)-c1ccccc1C(F)(F)F
Show InChI InChI=1S/C21H11F3N2O3/c22-21(23,24)13-4-2-1-3-10(13)11-8-15-16(18-17(11)19(28)26-20(18)29)12-7-9(27)5-6-14(12)25-15/h1-8,25,27H,(H,26,28,29)
NCI pathway
Reactome pathway
n/an/a 580n/an/an/an/an/an/a
Chulalongkorn University
Curated by ChEMBL
Assay Description
Inhibition of human Wee1
Eur J Med Chem 44: 1383-95 (2009)
Article DOI: 10.1016/j.ejmech.2008.09.027
BindingDB Entry DOI: 10.7270/Q2X34XB6
Serine/threonine-protein kinase WEE1
(Homo sapiens (Human))
BDBM50192410
(9-hydroxy-4-(2-(trifluoromethyl)phenyl)pyrrolo[3,4...)
Show SMILES Oc1ccc2[nH]c3cc(c4C(=O)NC(=O)c4c3c2c1)-c1ccccc1C(F)(F)F
Show InChI InChI=1S/C21H11F3N2O3/c22-21(23,24)13-4-2-1-3-10(13)11-8-15-16(18-17(11)19(28)26-20(18)29)12-7-9(27)5-6-14(12)25-15/h1-8,25,27H,(H,26,28,29)
NCI pathway
Reactome pathway
n/an/a 580n/an/an/an/an/an/a
University of Auckland
Curated by ChEMBL
Assay Description
Inhibition of human Wee1 in presence of 9.5 uM ATP
J Med Chem 49: 4896-911 (2006)
Article DOI: 10.1021/jm0512591
BindingDB Entry DOI: 10.7270/Q23778BD