BDBM50192659 CHEMBL3894794
SMILES: Fc1ccc(NC(=O)N2N=C(CC2c2ccc(F)cc2)c2ccc(Br)cc2)cc1
InChI Key: InChIKey=CJHDUQNADHUXSB-UHFFFAOYSA-N
Data: 2 IC50
Activity Spreadsheet -- Enzyme Inhibition Constant Data from BindingDB
Found 2 hits for monomerid = 50192659
Trg + Lig
Ki
nM
ΔG°
kcal/mole
IC50
nM
Kd
nM
EC50/IC50
nM
koff
s-1
kon
M-1s-1
pHTemp
°C
Voltage-gated calcium channel
(Homo sapiens (Human))
BDBM50192659
(CHEMBL3894794)
Show SMILES Fc1ccc(NC(=O)N2N=C(CC2c2ccc(F)cc2)c2ccc(Br)cc2)cc1 |c:9|
Show InChI InChI=1S/C22H16BrF2N3O/c23-16-5-1-14(2-6-16)20-13-21(15-3-7-17(24)8-4-15)28(27-20)22(29)26-19-11-9-18(25)10-12-19/h1-12,21H,13H2,(H,26,29)
n/an/a>1.00E+4n/an/an/an/an/an/a
Actelion Pharmaceuticals Ltd.
Curated by ChEMBL
Assay Description
Inhibition of recombinant T-type calcium channel Cav1.2 (unknown origin) expressed in HEK293 cells assessed as inhibition of Kcl-induced calcium infl...
J Med Chem 59: 8398-411 (2016)
BindingDB Entry DOI: 10.7270/Q2J67JWK
Voltage-dependent T-type calcium channel subunit alpha-1H
(Homo sapiens (Human))
BDBM50192659
(CHEMBL3894794)
Show SMILES Fc1ccc(NC(=O)N2N=C(CC2c2ccc(F)cc2)c2ccc(Br)cc2)cc1 |c:9|
Show InChI InChI=1S/C22H16BrF2N3O/c23-16-5-1-14(2-6-16)20-13-21(15-3-7-17(24)8-4-15)28(27-20)22(29)26-19-11-9-18(25)10-12-19/h1-12,21H,13H2,(H,26,29)
n/an/a 16n/an/an/an/an/an/a
Actelion Pharmaceuticals Ltd.
Curated by ChEMBL
Assay Description
Inhibition of human T-type calcium channel Cav3.2 expressed in CHO cells assessed as inhibition of calcium tail current at -90 mV holding potential m...
J Med Chem 59: 8398-411 (2016)
BindingDB Entry DOI: 10.7270/Q2J67JWK