null
SMILES: COc1ccc(NC(=O)N2N=C(CC2c2ccc(F)cc2)c2ccc(Br)cc2)cc1
InChI Key: InChIKey=KVFQRBAKLYBANP-UHFFFAOYSA-N
Activity Spreadsheet -- Enzyme Inhibition Constant Data from BindingDB
Found 2 hits for monomerid = 50192667
Trg + Lig
Ki
nM
ΔG°
kcal/mole
IC50
nM
Kd
nM
EC50/IC50
nM
koff
s-1
kon
M-1s-1
pHTemp
°C
Voltage-dependent L-type calcium channel subunit alpha-1C
(Homo sapiens (Human))
BDBM50192667
(CHEMBL3933724)
Show SMILES COc1ccc(NC(=O)N2N=C(CC2c2ccc(F)cc2)c2ccc(Br)cc2)cc1 |c:10|
Show InChI InChI=1S/C23H19BrFN3O2/c1-30-20-12-10-19(11-13-20)26-23(29)28-22(16-4-8-18(25)9-5-16)14-21(27-28)15-2-6-17(24)7-3-15/h2-13,22H,14H2,1H3,(H,26,29)
n/an/a>1.00E+4n/an/an/an/an/an/a
Actelion Pharmaceuticals Ltd.
Curated by ChEMBL
Assay Description
Inhibition of recombinant T-type calcium channel Cav1.2 (unknown origin) expressed in HEK293 cells assessed as inhibition of Kcl-induced calcium infl...
J Med Chem 59: 8398-411 (2016)
BindingDB Entry DOI: 10.7270/Q2J67JWK
Voltage-dependent T-type calcium channel subunit alpha-1H
(Homo sapiens (Human))
BDBM50192667
(CHEMBL3933724)
Show SMILES COc1ccc(NC(=O)N2N=C(CC2c2ccc(F)cc2)c2ccc(Br)cc2)cc1 |c:10|
Show InChI InChI=1S/C23H19BrFN3O2/c1-30-20-12-10-19(11-13-20)26-23(29)28-22(16-4-8-18(25)9-5-16)14-21(27-28)15-2-6-17(24)7-3-15/h2-13,22H,14H2,1H3,(H,26,29)
n/an/a 447n/an/an/an/an/an/a
Actelion Pharmaceuticals Ltd.
Curated by ChEMBL
Assay Description
Inhibition of recombinant T-type calcium channel Cav3.2 (unknown origin) expressed in HEK293 cells assessed as inhibition of CaCl2-induced calcium in...
J Med Chem 59: 8398-411 (2016)
BindingDB Entry DOI: 10.7270/Q2J67JWK