BDBM50192740 CHEMBL3932660
SMILES: Fc1ccc(cc1)C1CC(=NN1C(=O)NCCc1ccccc1)c1ccc(Br)cc1
InChI Key: InChIKey=ZYBCDJSJGJAUAE-UHFFFAOYSA-N
Data: 2 IC50
Activity Spreadsheet -- Enzyme Inhibition Constant Data from BindingDB
Found 2 hits for monomerid = 50192740
Trg + Lig
Ki
nM
ΔG°
kcal/mole
IC50
nM
Kd
nM
EC50/IC50
nM
koff
s-1
kon
M-1s-1
pHTemp
°C
Voltage-dependent T-type calcium channel subunit alpha-1H
(Homo sapiens (Human))
BDBM50192740
(CHEMBL3932660)
Show SMILES Fc1ccc(cc1)C1CC(=NN1C(=O)NCCc1ccccc1)c1ccc(Br)cc1 |c:10|
Show InChI InChI=1S/C24H21BrFN3O/c25-20-10-6-18(7-11-20)22-16-23(19-8-12-21(26)13-9-19)29(28-22)24(30)27-15-14-17-4-2-1-3-5-17/h1-13,23H,14-16H2,(H,27,30)
n/an/a 420n/an/an/an/an/an/a
Actelion Pharmaceuticals Ltd.
Curated by ChEMBL
Assay Description
Inhibition of human T-type calcium channel Cav3.2 expressed in CHO cells assessed as inhibition of calcium tail current at -90 mV holding potential m...
J Med Chem 59: 8398-411 (2016)
BindingDB Entry DOI: 10.7270/Q2J67JWK
Voltage-gated calcium channel
(Homo sapiens (Human))
BDBM50192740
(CHEMBL3932660)
Show SMILES Fc1ccc(cc1)C1CC(=NN1C(=O)NCCc1ccccc1)c1ccc(Br)cc1 |c:10|
Show InChI InChI=1S/C24H21BrFN3O/c25-20-10-6-18(7-11-20)22-16-23(19-8-12-21(26)13-9-19)29(28-22)24(30)27-15-14-17-4-2-1-3-5-17/h1-13,23H,14-16H2,(H,27,30)
n/an/a 1.88E+3n/an/an/an/an/an/a
Actelion Pharmaceuticals Ltd.
Curated by ChEMBL
Assay Description
Inhibition of recombinant T-type calcium channel Cav1.2 (unknown origin) expressed in HEK293 cells assessed as inhibition of Kcl-induced calcium infl...
J Med Chem 59: 8398-411 (2016)
BindingDB Entry DOI: 10.7270/Q2J67JWK