BDBM50192803 CHEMBL3906685
SMILES: CO[C@@H]1C[C@@H]2CC[C@H](C1)N2C(=O)c1ccc(Nc2nc(cs2)-c2sc(C)nc2C)nc1
InChI Key: InChIKey=NIRLMVVCSRWKLO-FVQHAEBGSA-N
Data: 1 IC50
Activity Spreadsheet -- Enzyme Inhibition Constant Data from BindingDB
Found 1 hit for monomerid = 50192803
Trg + Lig
Ki
nM
ΔG°
kcal/mole
IC50
nM
Kd
nM
EC50/IC50
nM
koff
s-1
kon
M-1s-1
pHTemp
°C
Transient receptor potential cation channel subfamily V member 4
(Homo sapiens (Human))
BDBM50192803
(CHEMBL3906685)
Show SMILES CO[C@@H]1C[C@@H]2CC[C@H](C1)N2C(=O)c1ccc(Nc2nc(cs2)-c2sc(C)nc2C)nc1 |r|
Show InChI InChI=1S/C22H25N5O2S2/c1-12-20(31-13(2)24-12)18-11-30-22(25-18)26-19-7-4-14(10-23-19)21(28)27-15-5-6-16(27)9-17(8-15)29-3/h4,7,10-11,15-17H,5-6,8-9H2,1-3H3,(H,23,25,26)/t15-,16+,17+
n/an/a 2.40n/an/an/an/an/an/a
Shionogi& Co., Ltd
Curated by ChEMBL
Assay Description
Antagonist activity at human TRPV4 assessed as inhibition of 4alpha-PDD-induced activation
Bioorg Med Chem Lett 26: 4936-4941 (2016)
Article DOI: 10.1016/j.bmcl.2016.09.014
BindingDB Entry DOI: 10.7270/Q2154K06