BDBM50192807 CHEMBL3984947
SMILES: [H][C@]12CC[C@]([H])(C\C(C1)=N/OCC(F)(F)F)N2C(=O)c1ccc(Nc2nc(cs2)-c2sc(C)nc2C)nc1
InChI Key: InChIKey=HRPZHVMUTDQPOZ-LPMRMCHTSA-N
Data: 2 IC50
Activity Spreadsheet -- Enzyme Inhibition Constant Data from BindingDB
Found 2 hits for monomerid = 50192807
Trg + Lig
Ki
nM
ΔG°
kcal/mole
IC50
nM
Kd
nM
EC50/IC50
nM
koff
s-1
kon
M-1s-1
pHTemp
°C
Vanilloid receptor
(Rattus norvegicus)
BDBM50192807
(CHEMBL3984947)
Show SMILES [H][C@]12CC[C@]([H])(C\C(C1)=N/OCC(F)(F)F)N2C(=O)c1ccc(Nc2nc(cs2)-c2sc(C)nc2C)nc1 |r|
Show InChI InChI=1S/C23H23F3N6O2S2/c1-12-20(36-13(2)28-12)18-10-35-22(29-18)30-19-6-3-14(9-27-19)21(33)32-16-4-5-17(32)8-15(7-16)31-34-11-23(24,25)26/h3,6,9-10,16-17H,4-5,7-8,11H2,1-2H3,(H,27,29,30)/b31-15-/t16-,17+/m0/s1
Reactome pathway
n/an/a 18n/an/an/an/an/an/a
Shionogi& Co., Ltd
Curated by ChEMBL
Assay Description
Antagonist activity at rat TRPV4 assessed as inhibition of 4alpha-PDD-induced activation
Bioorg Med Chem Lett 26: 4936-4941 (2016)
Article DOI: 10.1016/j.bmcl.2016.09.014
BindingDB Entry DOI: 10.7270/Q2154K06
Transient receptor potential cation channel subfamily V member 4
(Homo sapiens (Human))
BDBM50192807
(CHEMBL3984947)
Show SMILES [H][C@]12CC[C@]([H])(C\C(C1)=N/OCC(F)(F)F)N2C(=O)c1ccc(Nc2nc(cs2)-c2sc(C)nc2C)nc1 |r|
Show InChI InChI=1S/C23H23F3N6O2S2/c1-12-20(36-13(2)28-12)18-10-35-22(29-18)30-19-6-3-14(9-27-19)21(33)32-16-4-5-17(32)8-15(7-16)31-34-11-23(24,25)26/h3,6,9-10,16-17H,4-5,7-8,11H2,1-2H3,(H,27,29,30)/b31-15-/t16-,17+/m0/s1
n/an/a 0.360n/an/an/an/an/an/a
Shionogi& Co., Ltd
Curated by ChEMBL
Assay Description
Antagonist activity at human TRPV4 assessed as inhibition of 4alpha-PDD-induced activation
Bioorg Med Chem Lett 26: 4936-4941 (2016)
Article DOI: 10.1016/j.bmcl.2016.09.014
BindingDB Entry DOI: 10.7270/Q2154K06