null
SMILES: [H][C@]12CC[C@]([H])(CC(C1)=NOCC(C)(C)O)N2C(=O)c1ccc(Nc2nc(cs2)-c2sc(C)nc2C)nc1
InChI Key: InChIKey=XXYGNWXZPNKSLD-KDURUIRLSA-N
Activity Spreadsheet -- Enzyme Inhibition Constant Data from BindingDB
Found 1 hit for monomerid = 50192816
Trg + Lig
Ki
nM
ΔG°
kcal/mole
IC50
nM
Kd
nM
EC50/IC50
nM
koff
s-1
kon
M-1s-1
pHTemp
°C
Transient receptor potential cation channel subfamily V member 4
(Homo sapiens (Human))
BDBM50192816
(CHEMBL3968344)
Show SMILES [H][C@]12CC[C@]([H])(CC(C1)=NOCC(C)(C)O)N2C(=O)c1ccc(Nc2nc(cs2)-c2sc(C)nc2C)nc1 |r|
Show InChI InChI=1S/C25H30N6O3S2/c1-14-22(36-15(2)27-14)20-12-35-24(28-20)29-21-8-5-16(11-26-21)23(32)31-18-6-7-19(31)10-17(9-18)30-34-13-25(3,4)33/h5,8,11-12,18-19,33H,6-7,9-10,13H2,1-4H3,(H,26,28,29)/t18-,19+
n/an/a 4.40n/an/an/an/an/an/a
Shionogi& Co., Ltd
Curated by ChEMBL
Assay Description
Antagonist activity at human TRPV4 assessed as inhibition of 4alpha-PDD-induced activation
Bioorg Med Chem Lett 26: 4936-4941 (2016)
Article DOI: 10.1016/j.bmcl.2016.09.014
BindingDB Entry DOI: 10.7270/Q2154K06