BDBM50192843 CHEMBL3358968
SMILES: COc1ccc(cc1)-c1nc(c[nH]c1=O)-c1c[nH]c2ccccc12
InChI Key: InChIKey=BJJZRZDESBEILL-UHFFFAOYSA-N
Data: 1 IC50
Activity Spreadsheet -- Enzyme Inhibition Constant Data from BindingDB
Found 1 hit for monomerid = 50192843
Trg + Lig
Ki
nM
ΔG°
kcal/mole
IC50
nM
Kd
nM
EC50/IC50
nM
koff
s-1
kon
M-1s-1
pHTemp
°C
Platelet-derived growth factor receptor beta
(Homo sapiens (Human))
BDBM50192843
(CHEMBL3358968)
Show SMILES COc1ccc(cc1)-c1nc(c[nH]c1=O)-c1c[nH]c2ccccc12
Show InChI InChI=1S/C19H15N3O2/c1-24-13-8-6-12(7-9-13)18-19(23)21-11-17(22-18)15-10-20-16-5-3-2-4-14(15)16/h2-11,20H,1H3,(H,21,23)
NCI pathway
Reactome pathway
n/an/a 1.90E+4n/an/an/an/an/an/a
Christian-Albrechts-University of Kiel
Curated by ChEMBL
Assay Description
Inhibition of human recombinant PDGFRbeta using poly(Ala,Glu,Lys,Tyr) substrate
J Med Chem 58: 170-82 (2015)
Article DOI: 10.1021/jm500373x
BindingDB Entry DOI: 10.7270/Q2ZG6V0R