BDBM50192845 CHEMBL3358971
SMILES: COc1ccc(c(OC)c1OC)-c1nc(c[nH]c1=O)-c1c[nH]c2ccccc12
InChI Key: InChIKey=UXWVPDYFDADXSI-UHFFFAOYSA-N
Data: 1 IC50
Activity Spreadsheet -- Enzyme Inhibition Constant Data from BindingDB
Found 1 hit for monomerid = 50192845
Trg + Lig
Ki
nM
ΔG°
kcal/mole
IC50
nM
Kd
nM
EC50/IC50
nM
koff
s-1
kon
M-1s-1
pHTemp
°C
Platelet-derived growth factor receptor beta
(Homo sapiens (Human))
BDBM50192845
(CHEMBL3358971)
Show SMILES COc1ccc(c(OC)c1OC)-c1nc(c[nH]c1=O)-c1c[nH]c2ccccc12
Show InChI InChI=1S/C21H19N3O4/c1-26-17-9-8-13(19(27-2)20(17)28-3)18-21(25)23-11-16(24-18)14-10-22-15-7-5-4-6-12(14)15/h4-11,22H,1-3H3,(H,23,25)
NCI pathway
Reactome pathway
n/an/a>1.00E+5n/an/an/an/an/an/a
Christian-Albrechts-University of Kiel
Curated by ChEMBL
Assay Description
Inhibition of human recombinant PDGFRbeta using poly(Ala,Glu,Lys,Tyr) substrate
J Med Chem 58: 170-82 (2015)
Article DOI: 10.1021/jm500373x
BindingDB Entry DOI: 10.7270/Q2ZG6V0R