BDBM50192877 CHEMBL3358999
SMILES: COc1cc(ccc1O)-c1c[nH]c(=O)c(n1)-c1cc(OC)c(OC)c(OC)c1
InChI Key: InChIKey=XRMSZZGPKBSNTA-UHFFFAOYSA-N
Data: 3 IC50
Activity Spreadsheet -- Enzyme Inhibition Constant Data from BindingDB
Found 3 hits for monomerid = 50192877
Trg + Lig
Ki
nM
ΔG°
kcal/mole
IC50
nM
Kd
nM
EC50/IC50
nM
koff
s-1
kon
M-1s-1
pHTemp
°C
Platelet-derived growth factor receptor beta
(Homo sapiens (Human))
BDBM50192877
(CHEMBL3358999)
Show SMILES COc1cc(ccc1O)-c1c[nH]c(=O)c(n1)-c1cc(OC)c(OC)c(OC)c1
Show InChI InChI=1S/C20H20N2O6/c1-25-15-7-11(5-6-14(15)23)13-10-21-20(24)18(22-13)12-8-16(26-2)19(28-4)17(9-12)27-3/h5-10,23H,1-4H3,(H,21,24)
NCI pathway
Reactome pathway
n/an/a 20n/an/an/an/an/an/a
Christian-Albrechts-University of Kiel
Curated by ChEMBL
Assay Description
Inhibition of human recombinant PDGFRbeta using poly(Ala,Glu,Lys,Tyr) substrate
J Med Chem 58: 170-82 (2015)
Article DOI: 10.1021/jm500373x
BindingDB Entry DOI: 10.7270/Q2ZG6V0R
Vascular endothelial growth factor receptor 2
(Homo sapiens (Human))
BDBM50192877
(CHEMBL3358999)
Show SMILES COc1cc(ccc1O)-c1c[nH]c(=O)c(n1)-c1cc(OC)c(OC)c(OC)c1
Show InChI InChI=1S/C20H20N2O6/c1-25-15-7-11(5-6-14(15)23)13-10-21-20(24)18(22-13)12-8-16(26-2)19(28-4)17(9-12)27-3/h5-10,23H,1-4H3,(H,21,24)
NCI pathway
Reactome pathway
n/an/a 200n/an/an/an/an/an/a
Christian-Albrechts-University of Kiel
Curated by ChEMBL
Assay Description
Inhibition of human recombinant VEGFR2 using poly(Glu,Tyr) substrate
J Med Chem 58: 170-82 (2015)
Article DOI: 10.1021/jm500373x
BindingDB Entry DOI: 10.7270/Q2ZG6V0R
Mast/stem cell growth factor receptor Kit
(Homo sapiens (Human))
BDBM50192877
(CHEMBL3358999)
Show SMILES COc1cc(ccc1O)-c1c[nH]c(=O)c(n1)-c1cc(OC)c(OC)c(OC)c1
Show InChI InChI=1S/C20H20N2O6/c1-25-15-7-11(5-6-14(15)23)13-10-21-20(24)18(22-13)12-8-16(26-2)19(28-4)17(9-12)27-3/h5-10,23H,1-4H3,(H,21,24)
n/an/a 200n/an/an/an/an/an/a
Christian-Albrechts-University of Kiel
Curated by ChEMBL
Assay Description
Inhibition of human c-KiT
J Med Chem 58: 170-82 (2015)
Article DOI: 10.1021/jm500373x
BindingDB Entry DOI: 10.7270/Q2ZG6V0R