BDBM50193050 3-cyclopentyl-2-(furan-3-yl)-1-methyl-1H-indole-6-carboxylic acid::CHEMBL214864
SMILES: Cn1c(-c2ccoc2)c(C2CCCC2)c2ccc(cc12)C(O)=O
InChI Key: InChIKey=MYLJUTRJQNTPBA-UHFFFAOYSA-N
Data: 1 IC50
Activity Spreadsheet -- Enzyme Inhibition Constant Data from BindingDB
Found 1 hit for monomerid = 50193050
Trg + Lig
Ki
nM
ΔG°
kcal/mole
IC50
nM
Kd
nM
EC50/IC50
nM
koff
s-1
kon
M-1s-1
pHTemp
°C
Hepatitis C virus NS5B RNA-dependent RNA polymerase
(Hepatitis C virus)
BDBM50193050
(3-cyclopentyl-2-(furan-3-yl)-1-methyl-1H-indole-6-...)
Show SMILES Cn1c(-c2ccoc2)c(C2CCCC2)c2ccc(cc12)C(O)=O
Show InChI InChI=1S/C19H19NO3/c1-20-16-10-13(19(21)22)6-7-15(16)17(12-4-2-3-5-12)18(20)14-8-9-23-11-14/h6-12H,2-5H2,1H3,(H,21,22)
n/an/a 21n/an/an/an/an/an/a
Boehringer Ingelheim
Curated by ChEMBL
Assay Description
Inhibition of HCV 1b NS5B delta21 RNA dependent RNA polymerase by SPA
Bioorg Med Chem Lett 16: 4987-93 (2006)
Checked by Author
Article DOI: 10.1016/j.bmcl.2006.07.074
BindingDB Entry DOI: 10.7270/Q27S7PJT