BDBM50193062 3-cyclohexyl-1-methyl-2-(pyridin-2-yl)-1H-indole-6-carboxylic acid::CHEMBL215233
SMILES: Cn1c(c(C2CCCCC2)c2ccc(cc12)C(O)=O)-c1ccccn1
InChI Key: InChIKey=JXMRHSOBYAONNP-UHFFFAOYSA-N
Data: 1 IC50
Activity Spreadsheet -- Enzyme Inhibition Constant Data from BindingDB
Found 1 hit for monomerid = 50193062
Trg + Lig
Ki
nM
ΔG°
kcal/mole
IC50
nM
Kd
nM
EC50/IC50
nM
koff
s-1
kon
M-1s-1
pHTemp
°C
Hepatitis C virus NS5B RNA-dependent RNA polymerase
(Hepatitis C virus)
BDBM50193062
(3-cyclohexyl-1-methyl-2-(pyridin-2-yl)-1H-indole-6...)
Show SMILES Cn1c(c(C2CCCCC2)c2ccc(cc12)C(O)=O)-c1ccccn1
Show InChI InChI=1S/C21H22N2O2/c1-23-18-13-15(21(24)25)10-11-16(18)19(14-7-3-2-4-8-14)20(23)17-9-5-6-12-22-17/h5-6,9-14H,2-4,7-8H2,1H3,(H,24,25)
n/an/a 90n/an/an/an/an/an/a
Boehringer Ingelheim
Curated by ChEMBL
Assay Description
Inhibition of HCV 1b NS5B delta21 RNA dependent RNA polymerase by SPA
Bioorg Med Chem Lett 16: 4987-93 (2006)
Checked by Author
Article DOI: 10.1016/j.bmcl.2006.07.074
BindingDB Entry DOI: 10.7270/Q27S7PJT