BDBM50193123 CHEMBL3954358
SMILES: Cl.CC1=CC(=O)N(Nc2nc(nc3sc(c(C)c23)-c2ccc(OC3CCNC3)cc2)-c2cccs2)C1=O
InChI Key: InChIKey=KDCGAIZALBNUQI-UHFFFAOYSA-N
Data: 1 IC50
Activity Spreadsheet -- Enzyme Inhibition Constant Data from BindingDB
Found 1 hit for monomerid = 50193123
Trg + Lig
Ki
nM
ΔG°
kcal/mole
IC50
nM
Kd
nM
EC50/IC50
nM
koff
s-1
kon
M-1s-1
pHTemp
°C
Receptor-type tyrosine-protein kinase FLT3
(Homo sapiens (Human))
BDBM50193123
(CHEMBL3954358)
Show SMILES Cl.CC1=CC(=O)N(Nc2nc(nc3sc(c(C)c23)-c2ccc(OC3CCNC3)cc2)-c2cccs2)C1=O |t:1|
Show InChI InChI=1S/C26H23N5O3S2.ClH/c1-14-12-20(32)31(26(14)33)30-24-21-15(2)22(36-25(21)29-23(28-24)19-4-3-11-35-19)16-5-7-17(8-6-16)34-18-9-10-27-13-18;/h3-8,11-12,18,27H,9-10,13H2,1-2H3,(H,28,29,30);1H
n/an/a 3.80n/an/an/an/an/an/a
Yonsei University
Curated by ChEMBL
Assay Description
Inhibition of recombinant human FLT3 expressed in insect Sf21 cells preincubated for 15 mins followed by poly(Glu:Tyr) substrate addition for 30 mins...
Eur J Med Chem 120: 74-85 (2016)
Article DOI: 10.1016/j.ejmech.2016.05.022
BindingDB Entry DOI: 10.7270/Q2BG2QX3