BDBM50193258 CHEMBL3953814
SMILES: Cl.CN(C)CCOc1ccc(cc1)C(=C(\CCCO)c1cccc(F)c1)\c1ccc(Br)cc1
InChI Key: InChIKey=BGULTHNBAVATEI-JTHROIFXSA-N
Data: 1 IC50
Activity Spreadsheet -- Enzyme Inhibition Constant Data from BindingDB
Found 1 hit for monomerid = 50193258
Trg + Lig
Ki
nM
ΔG°
kcal/mole
IC50
nM
Kd
nM
EC50/IC50
nM
koff
s-1
kon
M-1s-1
pHTemp
°C
Estrogen-related receptor gamma
(Homo sapiens (Human))
BDBM50193258
(CHEMBL3953814)
Show SMILES Cl.CN(C)CCOc1ccc(cc1)C(=C(\CCCO)c1cccc(F)c1)\c1ccc(Br)cc1
Show InChI InChI=1S/C27H29BrFNO2.ClH/c1-30(2)16-18-32-25-14-10-21(11-15-25)27(20-8-12-23(28)13-9-20)26(7-4-17-31)22-5-3-6-24(29)19-22;/h3,5-6,8-15,19,31H,4,7,16-18H2,1-2H3;1H/b27-26-;
Reactome pathway
n/an/a 1.10E+3n/an/an/an/an/an/a
Daegu-Gyeongbuk Medical Innovation Foundation
Curated by ChEMBL
Assay Description
Inhibition of fluorescien-conjugated coactivator PGC1a binding to GST-tagged human ERRgamma LBD after 1 hr by TR-FRET assay
Eur J Med Chem 120: 338-52 (2016)
Article DOI: 10.1016/j.ejmech.2016.04.076
BindingDB Entry DOI: 10.7270/Q2TH8PN2