BDBM50193323 (E)-1-phenyl-3-(4-pyridin-2-ylpiperazin-1-yl)propan-1-one O-ethyloxime::CHEMBL212782
SMILES: CCO\N=C(/CCN1CCN(CC1)c1ccccn1)c1ccccc1
InChI Key: InChIKey=RBMOPDXMDCXDDP-ZBJSNUHESA-N
Data: 2 KI  1 IC50  2 EC50
Activity Spreadsheet -- Enzyme Inhibition Constant Data from BindingDB
Found 5 hits for monomerid = 50193323
Trg + Lig
Ki
nM
ΔG°
kcal/mole
IC50
nM
Kd
nM
EC50/IC50
nM
koff
s-1
kon
M-1s-1
pHTemp
°C
D(4) dopamine receptor
(Homo sapiens (Human))
BDBM50193323
((E)-1-phenyl-3-(4-pyridin-2-ylpiperazin-1-yl)propa...)
Show SMILES CCO\N=C(/CCN1CCN(CC1)c1ccccn1)c1ccccc1
Show InChI InChI=1S/C20H26N4O/c1-2-25-22-19(18-8-4-3-5-9-18)11-13-23-14-16-24(17-15-23)20-10-6-7-12-21-20/h3-10,12H,2,11,13-17H2,1H3/b22-19+
Reactome pathway
38n/an/an/an/an/an/an/an/a
Abbott Laboratories
Curated by ChEMBL
Assay Description
Displacement of [3H]A-369508 from human recombinant D4.4 receptor expressed in HEK293 cell membrane
J Med Chem 49: 5093-109 (2006)
Article DOI: 10.1021/jm060279f
BindingDB Entry DOI: 10.7270/Q2CJ8D4B
D(2) dopamine receptor
(Homo sapiens (Human))
BDBM50193323
((E)-1-phenyl-3-(4-pyridin-2-ylpiperazin-1-yl)propa...)
Show SMILES CCO\N=C(/CCN1CCN(CC1)c1ccccn1)c1ccccc1
Show InChI InChI=1S/C20H26N4O/c1-2-25-22-19(18-8-4-3-5-9-18)11-13-23-14-16-24(17-15-23)20-10-6-7-12-21-20/h3-10,12H,2,11,13-17H2,1H3/b22-19+
Reactome pathway
128n/an/an/an/an/an/an/an/a
Abbott Laboratories
Curated by ChEMBL
Assay Description
Displacement of [3H]PIPAT from human recombinant D2L receptor expressed in HEK293 cells
J Med Chem 49: 5093-109 (2006)
Article DOI: 10.1021/jm060279f
BindingDB Entry DOI: 10.7270/Q2CJ8D4B
D(4) dopamine receptor
(Homo sapiens (Human))
BDBM50193323
((E)-1-phenyl-3-(4-pyridin-2-ylpiperazin-1-yl)propa...)
Show SMILES CCO\N=C(/CCN1CCN(CC1)c1ccccn1)c1ccccc1
Show InChI InChI=1S/C20H26N4O/c1-2-25-22-19(18-8-4-3-5-9-18)11-13-23-14-16-24(17-15-23)20-10-6-7-12-21-20/h3-10,12H,2,11,13-17H2,1H3/b22-19+
Reactome pathway
n/an/an/an/a 28.5n/an/an/an/a
Abbott Laboratories
Curated by ChEMBL
Assay Description
Activity at human recombinant D4.4 receptor expressed in HEK293 cells by FLIPR assay
J Med Chem 49: 5093-109 (2006)
Article DOI: 10.1021/jm060279f
BindingDB Entry DOI: 10.7270/Q2CJ8D4B
D(2) dopamine receptor
(Homo sapiens (Human))
BDBM50193323
((E)-1-phenyl-3-(4-pyridin-2-ylpiperazin-1-yl)propa...)
Show SMILES CCO\N=C(/CCN1CCN(CC1)c1ccccn1)c1ccccc1
Show InChI InChI=1S/C20H26N4O/c1-2-25-22-19(18-8-4-3-5-9-18)11-13-23-14-16-24(17-15-23)20-10-6-7-12-21-20/h3-10,12H,2,11,13-17H2,1H3/b22-19+
Reactome pathway
n/an/an/an/a>1.00E+4n/an/an/an/a
Abbott Laboratories
Curated by ChEMBL
Assay Description
Agonist activity at human recombinant D2 receptor expressed in HEK293 cells by FLIPR assay
J Med Chem 49: 5093-109 (2006)
Article DOI: 10.1021/jm060279f
BindingDB Entry DOI: 10.7270/Q2CJ8D4B
D(2) dopamine receptor
(Homo sapiens (Human))
BDBM50193323
((E)-1-phenyl-3-(4-pyridin-2-ylpiperazin-1-yl)propa...)
Show SMILES CCO\N=C(/CCN1CCN(CC1)c1ccccn1)c1ccccc1
Show InChI InChI=1S/C20H26N4O/c1-2-25-22-19(18-8-4-3-5-9-18)11-13-23-14-16-24(17-15-23)20-10-6-7-12-21-20/h3-10,12H,2,11,13-17H2,1H3/b22-19+
Reactome pathway
n/an/a>1.00E+4n/an/an/an/an/an/a
Abbott Laboratories
Curated by ChEMBL
Assay Description
Antagonist activity at human recombinant D2 receptor expressed in HEK293 cells by FLIPR assay
J Med Chem 49: 5093-109 (2006)
Article DOI: 10.1021/jm060279f
BindingDB Entry DOI: 10.7270/Q2CJ8D4B