BDBM50193562 CHEMBL263515::[1-[2',5'-bis-O-(tert-butyldimethylsilyl)-beta-D-ribofuranosyl]-3-N-[3-N'-[valyl-glycylamino]propyl]thymine]-3'-spiro-5''-[4''-amino-1'',2''-oxathiole-2'',2''-dioxide]
SMILES: CC(C)[C@H](N)C(=O)NCC(=O)NCCCn1c(=O)c(C)cn(C2OC(CO[Si](C)(C)C(C)(C)C)C3(OS(=O)(=O)C=C3N)C2O[Si](C)(C)C(C)(C)C)c1=O
InChI Key: InChIKey=SUTLAHLSCJFDHQ-JTKYFTTJSA-N
Data: 1 IC50
Activity Spreadsheet -- Enzyme Inhibition Constant Data from BindingDB
Found 1 hit for monomerid = 50193562
Trg + Lig
Ki
nM
ΔG°
kcal/mole
IC50
nM
Kd
nM
EC50/IC50
nM
koff
s-1
kon
M-1s-1
pHTemp
°C
Human immunodeficiency virus type 1 reverse transcriptase
(Human immunodeficiency virus 1)
BDBM50193562
(CHEMBL263515 | [1-[2',5'-bis-O-(tert-butyldimethyl...)
Show SMILES CC(C)[C@H](N)C(=O)NCC(=O)NCCCn1c(=O)c(C)cn(C2OC(CO[Si](C)(C)C(C)(C)C)C3(OS(=O)(=O)C=C3N)C2O[Si](C)(C)C(C)(C)C)c1=O |c:39|
Show InChI InChI=1S/C34H62N6O10SSi2/c1-21(2)26(36)28(42)38-17-25(41)37-15-14-16-39-29(43)22(3)18-40(31(39)44)30-27(49-53(12,13)33(7,8)9)34(23(35)20-51(45,46)50-34)24(48-30)19-47-52(10,11)32(4,5)6/h18,20-21,24,26-27,30H,14-17,19,35-36H2,1-13H3,(H,37,41)(H,38,42)/t24?,26-,27?,30?,34?/m0/s1
n/an/a 3.80E+3n/an/an/an/an/an/a
Instituto de Química Médica (C.S.I.C.)
Curated by ChEMBL
Assay Description
Inhibition of recombinant HIV1 reverse transcriptase
J Med Chem 49: 5339-51 (2006)
Article DOI: 10.1021/jm0606490
BindingDB Entry DOI: 10.7270/Q2M32VDQ