BDBM50193589 CHEMBL3940448
SMILES: [O-][N+](=O)c1cc(\C=C2/S\C(NC2=O)=N/Cc2ccccc2)ccc1Cl
InChI Key: InChIKey=ULIHHNHJVKUBQD-DHDCSXOGSA-N
Data: 1 IC50
Activity Spreadsheet -- Enzyme Inhibition Constant Data from BindingDB
Found 1 hit for monomerid = 50193589
Trg + Lig
Ki
nM
ΔG°
kcal/mole
IC50
nM
Kd
nM
EC50/IC50
nM
koff
s-1
kon
M-1s-1
pHTemp
°C
Glycogen synthase kinase-3 beta
(Homo sapiens (Human))
BDBM50193589
(CHEMBL3940448)
Show SMILES [O-][N+](=O)c1cc(\C=C2/S\C(NC2=O)=N/Cc2ccccc2)ccc1Cl
Show InChI InChI=1S/C17H12ClN3O3S/c18-13-7-6-12(8-14(13)21(23)24)9-15-16(22)20-17(25-15)19-10-11-4-2-1-3-5-11/h1-9H,10H2,(H,19,20,22)/b15-9-
NCI pathway
Reactome pathway
n/an/a 24n/an/an/an/an/an/a
National Institute of Pharmaceutical Education and Research
Curated by ChEMBL
Assay Description
Inhibition of His-tagged full length human recombinant GSK-3beta expressed in Baculovirus using Ser/Thr9 peptide as substrate by Z' LYTE assay
Eur J Med Chem 121: 727-736 (2016)
Article DOI: 10.1016/j.ejmech.2016.04.075
BindingDB Entry DOI: 10.7270/Q2SJ1NK4