BDBM50193637 (E)-N-(4-amino-2-tert-butylquinolin-6-yl)-3-(4-(trifluoromethyl)phenyl)acrylamide::CHEMBL439358
SMILES: CC(C)(C)c1cc(N)c2cc(NC(=O)\C=C\c3ccc(cc3)C(F)(F)F)ccc2n1
InChI Key: InChIKey=FOZHABDRGZDSMZ-IZZDOVSWSA-N
Data: 1 IC50  1 EC50
Activity Spreadsheet -- Enzyme Inhibition Constant Data from BindingDB
Found 2 hits for monomerid = 50193637
Trg + Lig
Ki
nM
ΔG°
kcal/mole
IC50
nM
Kd
nM
EC50/IC50
nM
koff
s-1
kon
M-1s-1
pHTemp
°C
Melanin-concentrating hormone receptor
(Homo sapiens (Human))
BDBM50193637
((E)-N-(4-amino-2-tert-butylquinolin-6-yl)-3-(4-(tr...)
Show SMILES CC(C)(C)c1cc(N)c2cc(NC(=O)\C=C\c3ccc(cc3)C(F)(F)F)ccc2n1
Show InChI InChI=1S/C23H22F3N3O/c1-22(2,3)20-13-18(27)17-12-16(9-10-19(17)29-20)28-21(30)11-6-14-4-7-15(8-5-14)23(24,25)26/h4-13H,1-3H3,(H2,27,29)(H,28,30)/b11-6+
Reactome pathway
n/an/a 0.300n/an/an/an/an/an/a
Merck Research Laboratories
Curated by ChEMBL
Assay Description
Displacement of 125I-[Phe13,Tyr19]-MCH from human MCH-R1
Bioorg Med Chem Lett 16: 5275-9 (2006)
Article DOI: 10.1016/j.bmcl.2006.08.008
BindingDB Entry DOI: 10.7270/Q26T0M8S
Melanin-concentrating hormone receptor
(Homo sapiens (Human))
BDBM50193637
((E)-N-(4-amino-2-tert-butylquinolin-6-yl)-3-(4-(tr...)
Show SMILES CC(C)(C)c1cc(N)c2cc(NC(=O)\C=C\c3ccc(cc3)C(F)(F)F)ccc2n1
Show InChI InChI=1S/C23H22F3N3O/c1-22(2,3)20-13-18(27)17-12-16(9-10-19(17)29-20)28-21(30)11-6-14-4-7-15(8-5-14)23(24,25)26/h4-13H,1-3H3,(H2,27,29)(H,28,30)/b11-6+
Reactome pathway
n/an/an/an/a 29n/an/an/an/a
Merck Research Laboratories
Curated by ChEMBL
Assay Description
Stimulation of IP3-coupled mobilization of calcium in HEK293 cells expressing MCH-R1
Bioorg Med Chem Lett 16: 5275-9 (2006)
Article DOI: 10.1016/j.bmcl.2006.08.008
BindingDB Entry DOI: 10.7270/Q26T0M8S