BDBM50193696 CHEMBL385452::N-(2-(3-isobutyramidopyrrolidin-1-yl)quinolin-6-yl)-3-(4-(trifluoromethyl)phenyl)propanamide
SMILES: CC(C)C(=O)NC1CCN(C1)c1ccc2cc(NC(=O)CCc3ccc(cc3)C(F)(F)F)ccc2n1
InChI Key: InChIKey=YIMNCYNDKLUSBQ-UHFFFAOYSA-N
Data: 1 IC50  1 EC50
Activity Spreadsheet -- Enzyme Inhibition Constant Data from BindingDB
Found 2 hits for monomerid = 50193696
Trg + Lig
Ki
nM
ΔG°
kcal/mole
IC50
nM
Kd
nM
EC50/IC50
nM
koff
s-1
kon
M-1s-1
pHTemp
°C
Melanin-concentrating hormone receptor
(Homo sapiens (Human))
BDBM50193696
(CHEMBL385452 | N-(2-(3-isobutyramidopyrrolidin-1-y...)
Show SMILES CC(C)C(=O)NC1CCN(C1)c1ccc2cc(NC(=O)CCc3ccc(cc3)C(F)(F)F)ccc2n1
Show InChI InChI=1S/C27H29F3N4O2/c1-17(2)26(36)32-22-13-14-34(16-22)24-11-6-19-15-21(9-10-23(19)33-24)31-25(35)12-5-18-3-7-20(8-4-18)27(28,29)30/h3-4,6-11,15,17,22H,5,12-14,16H2,1-2H3,(H,31,35)(H,32,36)
Reactome pathway
n/an/a 1n/an/an/an/an/an/a
Merck Research Laboratories
Curated by ChEMBL
Assay Description
Displacement of 125I-[Phe13,Tyr19]-MCH from human MCH-R1
Bioorg Med Chem Lett 16: 5270-4 (2006)
Article DOI: 10.1016/j.bmcl.2006.08.006
BindingDB Entry DOI: 10.7270/Q2ZC82HP
GPR24
(RAT)
BDBM50193696
(CHEMBL385452 | N-(2-(3-isobutyramidopyrrolidin-1-y...)
Show SMILES CC(C)C(=O)NC1CCN(C1)c1ccc2cc(NC(=O)CCc3ccc(cc3)C(F)(F)F)ccc2n1
Show InChI InChI=1S/C27H29F3N4O2/c1-17(2)26(36)32-22-13-14-34(16-22)24-11-6-19-15-21(9-10-23(19)33-24)31-25(35)12-5-18-3-7-20(8-4-18)27(28,29)30/h3-4,6-11,15,17,22H,5,12-14,16H2,1-2H3,(H,31,35)(H,32,36)
Reactome pathway
n/an/an/an/a 90n/an/an/an/a
Merck Research Laboratories
Curated by ChEMBL
Assay Description
Stimulation of IP3-coupled mobilization of calcium in HEK293 cells expressing rat MCH-R1
Bioorg Med Chem Lett 16: 5270-4 (2006)
Article DOI: 10.1016/j.bmcl.2006.08.006
BindingDB Entry DOI: 10.7270/Q2ZC82HP