BDBM50193781 1-(3-((2S,4R)-4-(4-fluorobenzyl)-1-(2-hydroxyethyl)piperidin-2-yl)propyl)-3-(3-acetylphenyl)urea::CHEMBL220801
SMILES: CC(=O)c1cccc(NC(=O)NCCC[C@H]2C[C@H](Cc3ccc(F)cc3)CCN2CCO)c1
InChI Key: InChIKey=AEEJHYWVYVJIRH-OFVILXPXSA-N
Data: 3 KI  1 IC50
Activity Spreadsheet -- Enzyme Inhibition Constant Data from BindingDB
Found 4 hits for monomerid = 50193781
Trg + Lig
Ki
nM
ΔG°
kcal/mole
IC50
nM
Kd
nM
EC50/IC50
nM
koff
s-1
kon
M-1s-1
pHTemp
°C
Sodium-dependent serotonin transporter
(Homo sapiens (Human))
BDBM50193781
(1-(3-((2S,4R)-4-(4-fluorobenzyl)-1-(2-hydroxyethyl...)
Show SMILES CC(=O)c1cccc(NC(=O)NCCC[C@H]2C[C@H](Cc3ccc(F)cc3)CCN2CCO)c1
Show InChI InChI=1S/C26H34FN3O3/c1-19(32)22-4-2-5-24(18-22)29-26(33)28-12-3-6-25-17-21(11-13-30(25)14-15-31)16-20-7-9-23(27)10-8-20/h2,4-5,7-10,18,21,25,31H,3,6,11-17H2,1H3,(H2,28,29,33)/t21-,25-/m0/s1
50n/an/an/an/an/an/an/an/a
Bristol-Myers Squibb Pharmaceutical Research Institute
Curated by ChEMBL
Assay Description
Inhibition of 5HTT
Bioorg Med Chem Lett 16: 5695-9 (2006)
Article DOI: 10.1016/j.bmcl.2006.08.012
BindingDB Entry DOI: 10.7270/Q29K49VQ
Sodium-dependent noradrenaline transporter
(Homo sapiens (Human))
BDBM50193781
(1-(3-((2S,4R)-4-(4-fluorobenzyl)-1-(2-hydroxyethyl...)
Show SMILES CC(=O)c1cccc(NC(=O)NCCC[C@H]2C[C@H](Cc3ccc(F)cc3)CCN2CCO)c1
Show InChI InChI=1S/C26H34FN3O3/c1-19(32)22-4-2-5-24(18-22)29-26(33)28-12-3-6-25-17-21(11-13-30(25)14-15-31)16-20-7-9-23(27)10-8-20/h2,4-5,7-10,18,21,25,31H,3,6,11-17H2,1H3,(H2,28,29,33)/t21-,25-/m0/s1
Reactome pathway
1.82E+3n/an/an/an/an/an/an/an/a
Bristol-Myers Squibb Pharmaceutical Research Institute
Curated by ChEMBL
Assay Description
Inhibition of NET
Bioorg Med Chem Lett 16: 5695-9 (2006)
Article DOI: 10.1016/j.bmcl.2006.08.012
BindingDB Entry DOI: 10.7270/Q29K49VQ
Sodium-dependent dopamine transporter
(Homo sapiens (Human))
BDBM50193781
(1-(3-((2S,4R)-4-(4-fluorobenzyl)-1-(2-hydroxyethyl...)
Show SMILES CC(=O)c1cccc(NC(=O)NCCC[C@H]2C[C@H](Cc3ccc(F)cc3)CCN2CCO)c1
Show InChI InChI=1S/C26H34FN3O3/c1-19(32)22-4-2-5-24(18-22)29-26(33)28-12-3-6-25-17-21(11-13-30(25)14-15-31)16-20-7-9-23(27)10-8-20/h2,4-5,7-10,18,21,25,31H,3,6,11-17H2,1H3,(H2,28,29,33)/t21-,25-/m0/s1
NCI pathway
Reactome pathway
2.24E+3n/an/an/an/an/an/an/an/a
Bristol-Myers Squibb Pharmaceutical Research Institute
Curated by ChEMBL
Assay Description
Inhibition of DAT
Bioorg Med Chem Lett 16: 5695-9 (2006)
Article DOI: 10.1016/j.bmcl.2006.08.012
BindingDB Entry DOI: 10.7270/Q29K49VQ
C-C chemokine receptor type 3
(Homo sapiens (Human))
BDBM50193781
(1-(3-((2S,4R)-4-(4-fluorobenzyl)-1-(2-hydroxyethyl...)
Show SMILES CC(=O)c1cccc(NC(=O)NCCC[C@H]2C[C@H](Cc3ccc(F)cc3)CCN2CCO)c1
Show InChI InChI=1S/C26H34FN3O3/c1-19(32)22-4-2-5-24(18-22)29-26(33)28-12-3-6-25-17-21(11-13-30(25)14-15-31)16-20-7-9-23(27)10-8-20/h2,4-5,7-10,18,21,25,31H,3,6,11-17H2,1H3,(H2,28,29,33)/t21-,25-/m0/s1
Reactome pathway
n/an/a 7n/an/an/an/an/an/a
Bristol-Myers Squibb Pharmaceutical Research Institute
Curated by ChEMBL
Assay Description
Binding affinity to CCR3
Bioorg Med Chem Lett 16: 5695-9 (2006)
Article DOI: 10.1016/j.bmcl.2006.08.012
BindingDB Entry DOI: 10.7270/Q29K49VQ