BDBM50193873 7-(2,6-dimethylphenyl)-N-(3,4-dimethylphenyl)-5-methylbenzo[e][1,2,4]triazin-3-amine::CHEMBL220480::US8481536, 337
SMILES: Cc1ccc(Nc2nnc3cc(cc(C)c3n2)-c2c(C)cccc2C)cc1C
InChI Key: InChIKey=LVBDUBCUFKWBEQ-UHFFFAOYSA-N
Data: 2 IC50
Activity Spreadsheet -- Enzyme Inhibition Constant Data from BindingDB
Found 2 hits for monomerid = 50193873
Trg + Lig
Ki
nM
ΔG°
kcal/mole
IC50
nM
Kd
nM
EC50/IC50
nM
koff
s-1
kon
M-1s-1
pHTemp
°C
Proto-oncogene tyrosine-protein kinase Src
(Homo sapiens (Human))
BDBM50193873
(7-(2,6-dimethylphenyl)-N-(3,4-dimethylphenyl)-5-me...)
Show SMILES Cc1ccc(Nc2nnc3cc(cc(C)c3n2)-c2c(C)cccc2C)cc1C
Show InChI InChI=1S/C24H24N4/c1-14-9-10-20(12-17(14)4)25-24-26-23-18(5)11-19(13-21(23)27-28-24)22-15(2)7-6-8-16(22)3/h6-13H,1-5H3,(H,25,26,28)
n/an/a 960n/an/an/an/an/an/a
TargeGen, Inc.
Curated by ChEMBL
Assay Description
Inhibition of human recombinant Src kinase
Bioorg Med Chem Lett 16: 5546-50 (2006)
Article DOI: 10.1016/j.bmcl.2006.08.035
BindingDB Entry DOI: 10.7270/Q2SN08MP
Proto-oncogene tyrosine-protein kinase Src
(Homo sapiens (Human))
BDBM50193873
(7-(2,6-dimethylphenyl)-N-(3,4-dimethylphenyl)-5-me...)
Show SMILES Cc1ccc(Nc2nnc3cc(cc(C)c3n2)-c2c(C)cccc2C)cc1C
Show InChI InChI=1S/C24H24N4/c1-14-9-10-20(12-17(14)4)25-24-26-23-18(5)11-19(13-21(23)27-28-24)22-15(2)7-6-8-16(22)3/h6-13H,1-5H3,(H,25,26,28)
US Patent
n/an/a 957n/an/an/an/an/a25
TargeGen, Inc.
US Patent
Assay Description
Testing of inhibition of kinases in vitro using luciferase-based assay from KinaseGlo, Promega Corp.
US Patent US8481536 (2013)
BindingDB Entry DOI: 10.7270/Q2GB22PZ