BDBM50193876 3-(3-aminobenzo[e][1,2,4]triazin-7-yl)phenol::CHEMBL218003
SMILES: Nc1nnc2cc(ccc2n1)-c1cccc(O)c1
InChI Key: InChIKey=WCBDDBSMIBIXTG-UHFFFAOYSA-N
Data: 1 IC50
Activity Spreadsheet -- Enzyme Inhibition Constant Data from BindingDB
Found 1 hit for monomerid = 50193876
Trg + Lig
Ki
nM
ΔG°
kcal/mole
IC50
nM
Kd
nM
EC50/IC50
nM
koff
s-1
kon
M-1s-1
pHTemp
°C
Proto-oncogene tyrosine-protein kinase Src
(Homo sapiens (Human))
BDBM50193876
(3-(3-aminobenzo[e][1,2,4]triazin-7-yl)phenol | CHE...)
Show SMILES Nc1nnc2cc(ccc2n1)-c1cccc(O)c1
Show InChI InChI=1S/C13H10N4O/c14-13-15-11-5-4-9(7-12(11)16-17-13)8-2-1-3-10(18)6-8/h1-7,18H,(H2,14,15,17)
n/an/a 1.20E+4n/an/an/an/an/an/a
TargeGen, Inc.
Curated by ChEMBL
Assay Description
Inhibition of human recombinant Src kinase
Bioorg Med Chem Lett 16: 5546-50 (2006)
Article DOI: 10.1016/j.bmcl.2006.08.035
BindingDB Entry DOI: 10.7270/Q2SN08MP