BDBM50193881 CHEMBL220931::N-(3-(7-(2,6-dimethylphenyl)-5-methylbenzo[e][1,2,4]triazin-3-ylamino)phenyl)-2-(pyrrolidin-1-yl)ethanesulfonamide
SMILES: Cc1cccc(C)c1-c1cc(C)c2nc(Nc3cccc(NS(=O)(=O)CCN4CCCC4)c3)nnc2c1
InChI Key: InChIKey=RALCWZCHKNFZSA-UHFFFAOYSA-N
Data: 1 IC50
Activity Spreadsheet -- Enzyme Inhibition Constant Data from BindingDB
Found 1 hit for monomerid = 50193881
Trg + Lig
Ki
nM
ΔG°
kcal/mole
IC50
nM
Kd
nM
EC50/IC50
nM
koff
s-1
kon
M-1s-1
pHTemp
°C
Proto-oncogene tyrosine-protein kinase Src
(Homo sapiens (Human))
BDBM50193881
(CHEMBL220931 | N-(3-(7-(2,6-dimethylphenyl)-5-meth...)
Show SMILES Cc1cccc(C)c1-c1cc(C)c2nc(Nc3cccc(NS(=O)(=O)CCN4CCCC4)c3)nnc2c1
Show InChI InChI=1S/C28H32N6O2S/c1-19-8-6-9-20(2)26(19)22-16-21(3)27-25(17-22)31-32-28(30-27)29-23-10-7-11-24(18-23)33-37(35,36)15-14-34-12-4-5-13-34/h6-11,16-18,33H,4-5,12-15H2,1-3H3,(H,29,30,32)
n/an/a 26n/an/an/an/an/an/a
TargeGen, Inc.
Curated by ChEMBL
Assay Description
Inhibition of human recombinant Src kinase
Bioorg Med Chem Lett 16: 5546-50 (2006)
Article DOI: 10.1016/j.bmcl.2006.08.035
BindingDB Entry DOI: 10.7270/Q2SN08MP