BDBM50193885 7-(2,6-dimethylphenyl)-N-(4-methoxyphenyl)-5-methylbenzo[e][1,2,4]triazin-3-amine::CHEMBL220798::US8481536, 344
SMILES: COc1ccc(Nc2nnc3cc(cc(C)c3n2)-c2c(C)cccc2C)cc1
InChI Key: InChIKey=NCCBXUNIYZFBJX-UHFFFAOYSA-N
Data: 2 IC50
Activity Spreadsheet -- Enzyme Inhibition Constant Data from BindingDB
Found 2 hits for monomerid = 50193885
Trg + Lig
Ki
nM
ΔG°
kcal/mole
IC50
nM
Kd
nM
EC50/IC50
nM
koff
s-1
kon
M-1s-1
pHTemp
°C
Proto-oncogene tyrosine-protein kinase Src
(Homo sapiens (Human))
BDBM50193885
(7-(2,6-dimethylphenyl)-N-(4-methoxyphenyl)-5-methy...)
Show SMILES COc1ccc(Nc2nnc3cc(cc(C)c3n2)-c2c(C)cccc2C)cc1
Show InChI InChI=1S/C23H22N4O/c1-14-6-5-7-15(2)21(14)17-12-16(3)22-20(13-17)26-27-23(25-22)24-18-8-10-19(28-4)11-9-18/h5-13H,1-4H3,(H,24,25,27)
n/an/a 140n/an/an/an/an/an/a
TargeGen, Inc.
Curated by ChEMBL
Assay Description
Inhibition of human recombinant Src kinase
Bioorg Med Chem Lett 16: 5546-50 (2006)
Article DOI: 10.1016/j.bmcl.2006.08.035
BindingDB Entry DOI: 10.7270/Q2SN08MP
Proto-oncogene tyrosine-protein kinase Src
(Homo sapiens (Human))
BDBM50193885
(7-(2,6-dimethylphenyl)-N-(4-methoxyphenyl)-5-methy...)
Show SMILES COc1ccc(Nc2nnc3cc(cc(C)c3n2)-c2c(C)cccc2C)cc1
Show InChI InChI=1S/C23H22N4O/c1-14-6-5-7-15(2)21(14)17-12-16(3)22-20(13-17)26-27-23(25-22)24-18-8-10-19(28-4)11-9-18/h5-13H,1-4H3,(H,24,25,27)
US Patent
n/an/a 140n/an/an/an/an/a25
TargeGen, Inc.
US Patent
Assay Description
Testing of inhibition of kinases in vitro using luciferase-based assay from KinaseGlo, Promega Corp.
US Patent US8481536 (2013)
BindingDB Entry DOI: 10.7270/Q2GB22PZ