BDBM50193905 7-phenylbenzo[e][1,2,4]triazin-3-amine::CHEMBL218411
SMILES: Nc1nnc2cc(ccc2n1)-c1ccccc1
InChI Key: InChIKey=PCKQPBQSUNWING-UHFFFAOYSA-N
Data: 1 IC50
Activity Spreadsheet -- Enzyme Inhibition Constant Data from BindingDB
Found 1 hit for monomerid = 50193905
Trg + Lig
Ki
nM
ΔG°
kcal/mole
IC50
nM
Kd
nM
EC50/IC50
nM
koff
s-1
kon
M-1s-1
pHTemp
°C
Proto-oncogene tyrosine-protein kinase Src
(Homo sapiens (Human))
BDBM50193905
(7-phenylbenzo[e][1,2,4]triazin-3-amine | CHEMBL218...)
Show SMILES Nc1nnc2cc(ccc2n1)-c1ccccc1
Show InChI InChI=1S/C13H10N4/c14-13-15-11-7-6-10(8-12(11)16-17-13)9-4-2-1-3-5-9/h1-8H,(H2,14,15,17)
n/an/a>5.00E+4n/an/an/an/an/an/a
TargeGen, Inc.
Curated by ChEMBL
Assay Description
Inhibition of human recombinant Src kinase
Bioorg Med Chem Lett 16: 5546-50 (2006)
Article DOI: 10.1016/j.bmcl.2006.08.035
BindingDB Entry DOI: 10.7270/Q2SN08MP