BDBM50193909 7-(2,6-dimethylphenyl)-5-methyl-N-(4-(4-methyl-2-propoxypiperazin-1-yl)phenyl)benzo[e][1,2,4]triazin-3-amine::CHEMBL220929
SMILES: CCCOC1CN(C)CCN1c1ccc(Nc2nnc3cc(cc(C)c3n2)-c2c(C)cccc2C)cc1
InChI Key: InChIKey=FBTDGBLSXBQYMX-UHFFFAOYSA-N
Data: 1 IC50
Activity Spreadsheet -- Enzyme Inhibition Constant Data from BindingDB
Found 1 hit for monomerid = 50193909
Trg + Lig
Ki
nM
ΔG°
kcal/mole
IC50
nM
Kd
nM
EC50/IC50
nM
koff
s-1
kon
M-1s-1
pHTemp
°C
Proto-oncogene tyrosine-protein kinase Src
(Homo sapiens (Human))
BDBM50193909
(7-(2,6-dimethylphenyl)-5-methyl-N-(4-(4-methyl-2-p...)
Show SMILES CCCOC1CN(C)CCN1c1ccc(Nc2nnc3cc(cc(C)c3n2)-c2c(C)cccc2C)cc1
Show InChI InChI=1S/C30H36N6O/c1-6-16-37-27-19-35(5)14-15-36(27)25-12-10-24(11-13-25)31-30-32-29-22(4)17-23(18-26(29)33-34-30)28-20(2)8-7-9-21(28)3/h7-13,17-18,27H,6,14-16,19H2,1-5H3,(H,31,32,34)
n/an/a 36n/an/an/an/an/an/a
TargeGen, Inc.
Curated by ChEMBL
Assay Description
Inhibition of human recombinant Src kinase
Bioorg Med Chem Lett 16: 5546-50 (2006)
Article DOI: 10.1016/j.bmcl.2006.08.035
BindingDB Entry DOI: 10.7270/Q2SN08MP