BDBM50194052 5-4-2-chloro-5-trifluoromethyl)phenoxy)phenylamino)-3-hydroxy-N-1-hydroxypropan-2-yl)isothiazole-4-carboximidamide::CHEMBL217355
SMILES: CC(CO)N=C(N)c1c(Nc2ccc(Oc3cc(ccc3Cl)C(F)(F)F)cc2)s[nH]c1=O
InChI Key: InChIKey=UPMLNRIESVKRCO-UHFFFAOYSA-N
Data: 1 IC50  1 EC50
Activity Spreadsheet -- Enzyme Inhibition Constant Data from BindingDB
Found 2 hits for monomerid = 50194052
Trg + Lig
Ki
nM
ΔG°
kcal/mole
IC50
nM
Kd
nM
EC50/IC50
nM
koff
s-1
kon
M-1s-1
pHTemp
°C
Dual specificity mitogen-activated protein kinase kinase 1
(Homo sapiens (Human))
BDBM50194052
(5-4-2-chloro-5-trifluoromethyl)phenoxy)phenylamino...)
Show SMILES CC(CO)N=C(N)c1c(Nc2ccc(Oc3cc(ccc3Cl)C(F)(F)F)cc2)s[nH]c1=O |w:4.3|
Show InChI InChI=1S/C20H18ClF3N4O3S/c1-10(9-29)26-17(25)16-18(30)28-32-19(16)27-12-3-5-13(6-4-12)31-15-8-11(20(22,23)24)2-7-14(15)21/h2-8,10,27,29H,9H2,1H3,(H2,25,26)(H,28,30)
Reactome pathway
n/an/a 540n/an/an/an/an/an/a
Valeant Pharmaceuticals Research & Development
Curated by ChEMBL
Assay Description
Inhibition of MEK-1 activity
Bioorg Med Chem Lett 16: 5561-6 (2006)
Article DOI: 10.1016/j.bmcl.2006.08.048
BindingDB Entry DOI: 10.7270/Q2J38S5D
Dual specificity mitogen-activated protein kinase kinase 1
(Homo sapiens (Human))
BDBM50194052
(5-4-2-chloro-5-trifluoromethyl)phenoxy)phenylamino...)
Show SMILES CC(CO)N=C(N)c1c(Nc2ccc(Oc3cc(ccc3Cl)C(F)(F)F)cc2)s[nH]c1=O |w:4.3|
Show InChI InChI=1S/C20H18ClF3N4O3S/c1-10(9-29)26-17(25)16-18(30)28-32-19(16)27-12-3-5-13(6-4-12)31-15-8-11(20(22,23)24)2-7-14(15)21/h2-8,10,27,29H,9H2,1H3,(H2,25,26)(H,28,30)
Reactome pathway
n/an/an/an/a 350n/an/an/an/a
Valeant Pharmaceuticals Research & Development
Curated by ChEMBL
Assay Description
Inhibition of MEK-1 activity
Bioorg Med Chem Lett 16: 5561-6 (2006)
Article DOI: 10.1016/j.bmcl.2006.08.048
BindingDB Entry DOI: 10.7270/Q2J38S5D