BDBM50194190 CHEMBL3956184
SMILES: Cc1cccc2ccc(nc12)N1CC[C@H](C(=O)N[C@H]2CCC[C@H](CO)C2)C(C)(C)C1
InChI Key: InChIKey=FKSNPOBNMQCEGJ-SESVDKBCSA-N
Data: 3 IC50
Activity Spreadsheet -- Enzyme Inhibition Constant Data from BindingDB
Found 3 hits for monomerid = 50194190
Trg + Lig
Ki
nM
ΔG°
kcal/mole
IC50
nM
Kd
nM
EC50/IC50
nM
koff
s-1
kon
M-1s-1
pHTemp
°C
Prostaglandin E synthase
(Homo sapiens (Human))
BDBM50194190
(CHEMBL3956184)
Show SMILES Cc1cccc2ccc(nc12)N1CC[C@H](C(=O)N[C@H]2CCC[C@H](CO)C2)C(C)(C)C1 |r|
Show InChI InChI=1S/C25H35N3O2/c1-17-6-4-8-19-10-11-22(27-23(17)19)28-13-12-21(25(2,3)16-28)24(30)26-20-9-5-7-18(14-20)15-29/h4,6,8,10-11,18,20-21,29H,5,7,9,12-16H2,1-3H3,(H,26,30)/t18-,20-,21+/m0/s1
Reactome pathway
n/an/a 1n/an/an/an/an/an/a
Lilly Research Laboratories
Curated by ChEMBL
Assay Description
Inhibition of mPGES-1 in human whole blood assessed as reduction in LPS-induced PGE2 production preincubated for 30 mins followed by LPS stimulation ...
Bioorg Med Chem Lett 26: 4824-4828 (2016)
Article DOI: 10.1016/j.bmcl.2016.08.023
BindingDB Entry DOI: 10.7270/Q2125VMX
Prostaglandin E synthase
(Homo sapiens (Human))
BDBM50194190
(CHEMBL3956184)
Show SMILES Cc1cccc2ccc(nc12)N1CC[C@H](C(=O)N[C@H]2CCC[C@H](CO)C2)C(C)(C)C1 |r|
Show InChI InChI=1S/C25H35N3O2/c1-17-6-4-8-19-10-11-22(27-23(17)19)28-13-12-21(25(2,3)16-28)24(30)26-20-9-5-7-18(14-20)15-29/h4,6,8,10-11,18,20-21,29H,5,7,9,12-16H2,1-3H3,(H,26,30)/t18-,20-,21+/m0/s1
Reactome pathway
n/an/a 1n/an/an/an/an/an/a
Lilly Research Laboratories
Curated by ChEMBL
Assay Description
Inhibition of human mPGES-1 expressed in 293E cells assessed as reduction in conversion of PGH2 to PGE2 after 1.5 min by LC/MS analysis
Bioorg Med Chem Lett 26: 4824-4828 (2016)
Article DOI: 10.1016/j.bmcl.2016.08.023
BindingDB Entry DOI: 10.7270/Q2125VMX
Prostaglandin E synthase
(Homo sapiens (Human))
BDBM50194190
(CHEMBL3956184)
Show SMILES Cc1cccc2ccc(nc12)N1CC[C@H](C(=O)N[C@H]2CCC[C@H](CO)C2)C(C)(C)C1 |r|
Show InChI InChI=1S/C25H35N3O2/c1-17-6-4-8-19-10-11-22(27-23(17)19)28-13-12-21(25(2,3)16-28)24(30)26-20-9-5-7-18(14-20)15-29/h4,6,8,10-11,18,20-21,29H,5,7,9,12-16H2,1-3H3,(H,26,30)/t18-,20-,21+/m0/s1
Reactome pathway
n/an/a 3n/an/an/an/an/an/a
Lilly Research Laboratories
Curated by ChEMBL
Assay Description
Inhibition of mPGES-1 in human A549 cells assessed as reduction in recombinant human interleukin-1 beta-induced PGE2 production preincubated for 30 m...
Bioorg Med Chem Lett 26: 4824-4828 (2016)
Article DOI: 10.1016/j.bmcl.2016.08.023
BindingDB Entry DOI: 10.7270/Q2125VMX