BDBM50194237 CHEMBL377960::H-Dmt-Tic-NH-CH[(CH2)4-NH2]-Bid
SMILES: Cc1cc(O)cc(C)c1CC(N)C(=O)N1Cc2ccccc2CC1C(=O)NC(CCCCN)c1nc2ccccc2[nH]1
InChI Key: InChIKey=GDHJQGJCKHJHHZ-UHFFFAOYSA-N
Data: 2 KI  2 IC50
Activity Spreadsheet -- Enzyme Inhibition Constant Data from BindingDB
Found 4 hits for monomerid = 50194237
Trg + Lig
Ki
nM
ΔG°
kcal/mole
IC50
nM
Kd
nM
EC50/IC50
nM
koff
s-1
kon
M-1s-1
pHTemp
°C
Mu-type opioid receptor
(Rattus norvegicus (rat))
BDBM50194237
(CHEMBL377960 | H-Dmt-Tic-NH-CH[(CH2)4-NH2]-Bid)
Show SMILES Cc1cc(O)cc(C)c1CC(N)C(=O)N1Cc2ccccc2CC1C(=O)NC(CCCCN)c1nc2ccccc2[nH]1
Show InChI InChI=1S/C33H40N6O3/c1-20-15-24(40)16-21(2)25(20)18-26(35)33(42)39-19-23-10-4-3-9-22(23)17-30(39)32(41)38-29(13-7-8-14-34)31-36-27-11-5-6-12-28(27)37-31/h3-6,9-12,15-16,26,29-30,40H,7-8,13-14,17-19,34-35H2,1-2H3,(H,36,37)(H,38,41)
Reactome pathway
0.160n/an/an/an/an/an/an/an/a
University of Cagliari
Curated by ChEMBL
Assay Description
Displacement of [3H]DAMGO from mu opioid receptor in Sprague-Dawley rat brain P2 synaptosomal membrane
J Med Chem 49: 5610-7 (2006)
Article DOI: 10.1021/jm060741w
BindingDB Entry DOI: 10.7270/Q2416XTD
Opioid receptors; mu & delta
(Rattus norvegicus (rat))
BDBM50194237
(CHEMBL377960 | H-Dmt-Tic-NH-CH[(CH2)4-NH2]-Bid)
Show SMILES Cc1cc(O)cc(C)c1CC(N)C(=O)N1Cc2ccccc2CC1C(=O)NC(CCCCN)c1nc2ccccc2[nH]1
Show InChI InChI=1S/C33H40N6O3/c1-20-15-24(40)16-21(2)25(20)18-26(35)33(42)39-19-23-10-4-3-9-22(23)17-30(39)32(41)38-29(13-7-8-14-34)31-36-27-11-5-6-12-28(27)37-31/h3-6,9-12,15-16,26,29-30,40H,7-8,13-14,17-19,34-35H2,1-2H3,(H,36,37)(H,38,41)
Reactome pathway
0.490n/an/an/an/an/an/an/an/a
University of Cagliari
Curated by ChEMBL
Assay Description
Displacement of [3H]deltorphin2 from delta opioid receptor in Sprague-Dawley rat brain P2 synaptosomal membrane
J Med Chem 49: 5610-7 (2006)
Article DOI: 10.1021/jm060741w
BindingDB Entry DOI: 10.7270/Q2416XTD
Delta-type opioid receptor
(MOUSE)
BDBM50194237
(CHEMBL377960 | H-Dmt-Tic-NH-CH[(CH2)4-NH2]-Bid)
Show SMILES Cc1cc(O)cc(C)c1CC(N)C(=O)N1Cc2ccccc2CC1C(=O)NC(CCCCN)c1nc2ccccc2[nH]1
Show InChI InChI=1S/C33H40N6O3/c1-20-15-24(40)16-21(2)25(20)18-26(35)33(42)39-19-23-10-4-3-9-22(23)17-30(39)32(41)38-29(13-7-8-14-34)31-36-27-11-5-6-12-28(27)37-31/h3-6,9-12,15-16,26,29-30,40H,7-8,13-14,17-19,34-35H2,1-2H3,(H,36,37)(H,38,41)
Reactome pathway
n/an/a>1.00E+4n/an/an/an/an/an/a
University of Cagliari
Curated by ChEMBL
Assay Description
Agonist activity at delta opioid receptor assessed as inhibition of electrically-evoked contraction of mouse vas deferens
J Med Chem 49: 5610-7 (2006)
Article DOI: 10.1021/jm060741w
BindingDB Entry DOI: 10.7270/Q2416XTD
Mu-type opioid receptor
(GUINEA PIG)
BDBM50194237
(CHEMBL377960 | H-Dmt-Tic-NH-CH[(CH2)4-NH2]-Bid)
Show SMILES Cc1cc(O)cc(C)c1CC(N)C(=O)N1Cc2ccccc2CC1C(=O)NC(CCCCN)c1nc2ccccc2[nH]1
Show InChI InChI=1S/C33H40N6O3/c1-20-15-24(40)16-21(2)25(20)18-26(35)33(42)39-19-23-10-4-3-9-22(23)17-30(39)32(41)38-29(13-7-8-14-34)31-36-27-11-5-6-12-28(27)37-31/h3-6,9-12,15-16,26,29-30,40H,7-8,13-14,17-19,34-35H2,1-2H3,(H,36,37)(H,38,41)
n/an/a 39.7n/an/an/an/an/an/a
University of Cagliari
Curated by ChEMBL
Assay Description
Agonist activity at mu opioid receptor assessed as inhibition of electrically-evoked contraction of guinea pig ileum
J Med Chem 49: 5610-7 (2006)
Article DOI: 10.1021/jm060741w
BindingDB Entry DOI: 10.7270/Q2416XTD