BDBM50194278 4-(4-(5-(2-ethoxyethyl)-2,4,6-trioxo-hexahydropyrimidin-5-yloxy)phenoxy)-N-(pyridin-3-yl)benzamide::CHEMBL374041
SMILES: CCOCCC1(Oc2ccc(Oc3ccc(cc3)C(=O)Nc3cccnc3)cc2)C(=O)NC(=O)NC1=O
InChI Key: InChIKey=ABCSNHDQYHOLOO-UHFFFAOYSA-N
Data: 1 IC50
Activity Spreadsheet -- Enzyme Inhibition Constant Data from BindingDB
Found 1 hit for monomerid = 50194278
Trg + Lig
Ki
nM
ΔG°
kcal/mole
IC50
nM
Kd
nM
EC50/IC50
nM
koff
s-1
kon
M-1s-1
pHTemp
°C
Collagenase 3
(Homo sapiens (Human))
BDBM50194278
(4-(4-(5-(2-ethoxyethyl)-2,4,6-trioxo-hexahydropyri...)
Show SMILES CCOCCC1(Oc2ccc(Oc3ccc(cc3)C(=O)Nc3cccnc3)cc2)C(=O)NC(=O)NC1=O
Show InChI InChI=1S/C26H24N4O7/c1-2-35-15-13-26(23(32)29-25(34)30-24(26)33)37-21-11-9-20(10-12-21)36-19-7-5-17(6-8-19)22(31)28-18-4-3-14-27-16-18/h3-12,14,16H,2,13,15H2,1H3,(H,28,31)(H2,29,30,32,33,34)
NCI pathway
Reactome pathway
n/an/a 0.400n/an/an/an/an/an/a
Pfizer Global Research & Development
Curated by ChEMBL
Assay Description
Inhibition of MMP13
Bioorg Med Chem Lett 16: 5822-6 (2006)
Article DOI: 10.1016/j.bmcl.2006.08.066
BindingDB Entry DOI: 10.7270/Q27P8Z1R