BDBM50194293 2-(2-(4-(4-(5-(2-methoxyethyl)-2,4,6-trioxo-hexahydropyrimidin-5-yloxy)phenoxy)phenyl)oxazol-4-yl)benzonitrile::CHEMBL221267
SMILES: COCCC1(Oc2ccc(Oc3ccc(cc3)-c3nc(co3)-c3ccccc3C#N)cc2)C(=O)NC(=O)NC1=O
InChI Key: InChIKey=RBKFSOLEBKDLKQ-UHFFFAOYSA-N
Data: 1 IC50
Activity Spreadsheet -- Enzyme Inhibition Constant Data from BindingDB
Found 1 hit for monomerid = 50194293
Trg + Lig
Ki
nM
ΔG°
kcal/mole
IC50
nM
Kd
nM
EC50/IC50
nM
koff
s-1
kon
M-1s-1
pHTemp
°C
Collagenase 3
(Homo sapiens (Human))
BDBM50194293
(2-(2-(4-(4-(5-(2-methoxyethyl)-2,4,6-trioxo-hexahy...)
Show SMILES COCCC1(Oc2ccc(Oc3ccc(cc3)-c3nc(co3)-c3ccccc3C#N)cc2)C(=O)NC(=O)NC1=O
Show InChI InChI=1S/C29H22N4O7/c1-37-15-14-29(26(34)32-28(36)33-27(29)35)40-22-12-10-21(11-13-22)39-20-8-6-18(7-9-20)25-31-24(17-38-25)23-5-3-2-4-19(23)16-30/h2-13,17H,14-15H2,1H3,(H2,32,33,34,35,36)
NCI pathway
Reactome pathway
n/an/a 0.730n/an/an/an/an/an/a
Pfizer Global Research & Development
Curated by ChEMBL
Assay Description
Inhibition of MMP13
Bioorg Med Chem Lett 16: 5822-6 (2006)
Article DOI: 10.1016/j.bmcl.2006.08.066
BindingDB Entry DOI: 10.7270/Q27P8Z1R